CID,MAT_COUN,responded,surveylanguage,survey,covidtime,newprotocol,daysfromtxstart30,daysfromtxstart60,daysfromtxstart90,daysfromtxstart91plus,monthsenrolled,inanytx,currentbup,currentcoun,currentmmt,currentntx,difftx,endindextx,daysinxtx,adverse,tookmeds,indcoun,grpcoun,peernav,selfhelp90,coun90,ncoun90,abstinent30ohf,abstinent90ohfmb,opuse30,opuse30users,opabst90,fnuse30,fnuse30users,fnabst90,hruse30,hruse30users,hrabst90,mmbpabst90,diversionuse90,suoverdose,opoverdose,edvisit,opedvisit,hospstay,ophospstay,pcp90,mentalillness,insurance,healthins,nohealthins,employed,socialsupportscore,socialsupportcat,lowsocialsupport,modsocialsupport,highsocialsupport,ace,clienttostaffratio_impute,clienttostaffratio_raw,indexstatus,SS2,SS4,SS5_1,SS5_3,SS5_4,SS5_5,SS5_6,SS5_7,SS5_8,SS5_9,SS5_10,SS5_12,SS5_13,SS11_1,SS11_2,SS11_3,SS11_4,SS11_5,SS11_6,SS12_1,SS12_2,SS12_3,SS12_4,SS12_5,SS12_6,SS12_7,SS12_8,SS12_9,SS12_10,SS12_11,SS12_12,SS12_13,SS12_14,SS12_15,PN1,PN2,PN3,PN4_1,PN4_2,PN4_3,PN4_4,PN4_5,PN4_6,PN4_7,PN4_8,PN4_9,PN5_A,PN5_B,PN5_C,PN5_D,PN5_E,PX1,PX3A_R1,PX3B_R1,PX3C_R1,PX3D_R1,PX3E_R1,PX3F_R1,PX3G_R1,PX3I_R1,PX3J_R1,PX3K_R1,PX3L_R1,PX3M_R1,PX3N_R1,PX3O_R1,PX3P_R1,PX4_11_R1,PX5_1_R1,PX5_2_R1,PX5_3_R1,PX5_4_R1,PX5_5_R1,PX5_6_R1,PX5_7_R1,PX5_8_R1,PX5_9_R1,PX10_R1,PX11_R1,PX13_R1,PX13_R2,PX13_R3,PX13_R4,PX13_R5,PX13_R6,PX13_R7,PX13_R8,PX13_R9,PX13_R10,PX13_R11,PX13_R12,SA1,SA2,DW5,HS4,HS4A,ED4,ED4A,SH4,PC3,PC3A,HM1,HM2,HM3,HM4,HM5,HM6,SU1A,SU1B,SU1C,SU1D,SU1E,SU1F,SU1G,SU1H,SU1I,SU1J,SU1K,SU1L,SU1M,SU1N,SU1O,SU2,SU3,SU4,SU5,SU6,SU7,DO8,DO9,DO12,DO13,BF1,BF2,BF3,PQ1A_2,PQ1B_2,PQ1C_2,PQ1D_2,PQ1E_2,PQ1F_2,PQ1G_2,PQ1H_2,pufsite_ID
AAD78283BX,2,0,Z,2,Z,Z,Z,Z,Z,Z,Z,Z,Z,Z,Z,Z,Z,Z,Z,Z,Z,Z,Z,Z,Z,Z,Z,Z,Z,Z,Z,Z,Z,Z,Z,Z,Z,Z,Z,Z,Z,Z,Z,Z,Z,Z,Z,,Z,Z,Z,Z,,,,,,Z,Z,Z,Z,Z,Z,Z,Z,Z,Z,Z,Z,Z,Z,Z,Z,Z,Z,Z,Z,Z,Z,Z,Z,Z,Z,Z,Z,Z,Z,Z,Z,Z,Z,Z,Z,Z,Z,Z,Z,Z,Z,Z,Z,Z,Z,Z,Z,Z,Z,Z,Z,Z,Z,Z,Z,Z,Z,Z,Z,Z,Z,Z,Z,Z,Z,Z,Z,Z,Z,Z,Z,Z,Z,Z,Z,Z,Z,Z,Z,Z,Z,Z,Z,Z,Z,Z,Z,Z,Z,Z,Z,Z,Z,Z,Z,Z,Z,Z,Z,Z,Z,Z,Z,Z,Z,Z,Z,Z,Z,Z,Z,Z,Z,Z,Z,Z,Z,Z,Z,Z,Z,Z,Z,Z,Z,Z,Z,Z,Z,Z,Z,Z,Z,Z,Z,Z,Z,Z,Z,Z,Z,Z,Z,Z,Z,Z,10250
AAN33708XC,1,1,1,2,0,0,1,0,0,0,3.133333333,1,0,0,1,0,0,0,94,0,0,1,0,0,0,1,4,0,0,U,U,0,2,2,0,0,U,1,1,1,0,0,0,0,0,0,1,0,1,1,0,1,6.25,1,0,1,1,0,0,28.31818182,1,1,S,S,S,S,S,S,S,S,S,S,S,S,1,0,0,0,0,0,1,0,0,0,0,0,0,1,0,0,0,0,1,0,0,2,S,S,S,S,S,S,S,S,S,S,S,2,1,3,2,2,S,S,S,S,S,S,S,S,S,S,S,S,S,S,S,S,S,S,S,S,S,S,S,S,S,S,S,S,S,S,S,S,S,S,S,S,S,S,S,S,90,4,0,0,S,0,S,1,2,0,1,2,2,2,2,1,2,1,1,1,1,2,1,3,1,1,1,1,1,5,5,S,S,S,S,2,2,0,S,S,S,2,2,0,1,1,1,1,1,1,1,1,10090
AAR15284NQ,1,1,1,2,0,0,0,1,0,0,2.7,1,0,0,1,0,0,0,131,0,0,1,0,0,0,1,5,1,0,0,U,1,0,U,1,0,U,1,0,5,0,0,0,0,0,0,1,1,1,1,0,1,6.583333333,1,0,1,1,1,0,28.31818182,1,1,S,S,S,S,S,S,S,S,S,S,S,S,1,0,0,0,0,0,1,0,0,0,0,0,0,1,0,0,1,0,0,0,0,3,S,S,S,S,S,S,S,S,S,S,S,2,2,3,2,2,S,S,S,S,S,S,S,S,S,S,S,S,S,S,S,S,S,S,S,S,S,S,S,S,S,S,S,S,S,S,S,S,S,S,S,S,S,S,S,S,90,5,0,0,S,0,S,1,2,0,1,2,2,2,2,1,1,5,1,1,1,1,1,1,1,1,1,1,1,1,1,S,S,S,S,S,S,0,S,S,S,3,7,2,1,1,1,1,1,1,1,1,10090
ABA29348BB,1,1,1,2,0,1,0,0,0,1,3.133333333,1,0,0,1,0,0,0,1690,0,1,0,0,0,0,1,16,0,0,0,U,1,0,U,1,1,1,0,1,1,0,0,0,0,0,0,1,0,1,1,0,1,6,1,0,1,1,1,0,23.66666667,1,1,S,S,S,S,S,S,S,S,S,S,S,S,1,0,0,0,0,0,0,0,0,0,0,0,0,0,0,0,0,0,0,0,1,1,6,S,1,0,0,0,0,0,0,0,0,1,3,3,2,1,S,S,S,S,S,S,S,S,S,S,S,S,S,S,S,S,S,S,S,S,S,S,S,S,S,S,S,S,S,S,S,S,S,S,S,S,S,S,S,S,16,16,0,0,S,0,S,1,1,0,1,2,2,2,2,1,1,1,1,1,2,1,1,5,2,1,1,1,1,1,2,S,S,2,1,S,S,0,S,S,S,4,0,15,4,2,3,3,1,2,2,1,10120
ABG89352WF,1,1,1,2,0,1,0,0,0,1,2.533333333,1,0,0,1,0,0,0,5250,0,1,1,1,0,0,1,1,1,0,0,U,1,0,U,0,0,U,1,1,1,0,0,0,0,0,0,1,1,1,1,0,0,2.5,3,1,1,0,1,0,80.25,1,1,S,S,S,S,S,S,S,S,S,S,S,S,1,0,0,0,0,0,1,1,0,1,0,0,1,1,1,0,0,1,1,0,0,2,S,S,S,S,S,S,S,S,S,S,S,1,3,3,3,1,S,S,S,S,S,S,S,S,S,S,S,S,S,S,S,S,S,S,S,S,S,S,S,S,S,S,S,S,S,S,S,S,S,S,S,S,S,S,S,S,90,1,0,0,S,0,S,1,1,0,1,2,2,2,2,1,1,1,1,1,1,4,1,1,1,4,1,1,1,5,5,S,S,S,S,3,0,0,S,S,S,4,2,3,1,1,1,2,4,1,1,4,10500
ABR50992AF,2,1,1,2,0,1,0,1,0,0,2.4,1,1,0,0,0,0,0,121,1,1,1,1,1,1,1,8,1,1,0,U,1,0,U,1,0,U,1,1,1,0,0,0,0,0,0,1,1,1,1,0,0,5.583333333,1,0,1,1,0,0,5,1,1,S,S,S,S,S,S,S,S,S,S,S,S,0,0,0,1,0,0,1,0,0,0,0,0,0,0,0,0,0,0,0,0,0,1,2,1,S,S,S,S,S,S,S,S,S,1,3,2,3,1,S,S,S,S,S,S,S,S,S,S,S,S,S,S,S,S,S,S,S,S,S,S,S,S,S,S,S,S,S,S,S,S,S,S,S,S,S,S,S,S,10,8,0,0,S,0,S,3,2,0,2,1,2,1,2,1,1,1,1,1,1,1,1,1,1,1,1,1,1,1,1,S,S,S,S,S,S,0,S,S,S,3,4,10,2,2,2,1,1,2,1,1,10540
ABR92091QN,1,1,1,2,0,0,1,0,0,0,3.533333333,1,0,0,1,0,0,0,106,0,1,1,1,1,1,1,15,0,0,0,U,1,0,U,1,5,5,0,1,1,0,0,1,1,1,1,1,0,1,1,0,0,2,3,1,1,0,1,0,25.37037037,1,1,S,S,S,S,S,S,S,S,S,S,S,S,1,0,0,0,0,0,1,1,0,0,0,1,0,1,0,0,0,0,0,0,0,1,5,1,S,S,S,S,S,S,S,S,S,1,3,3,3,1,S,S,S,S,S,S,S,S,S,S,S,S,S,S,S,S,S,S,S,S,S,S,S,S,S,S,S,S,S,S,S,S,S,S,S,S,S,S,S,S,90,15,0,10,10,10,10,5,5,0,1,2,2,2,2,1,1,1,1,1,4,1,1,5,1,1,1,1,1,1,5,S,S,10,5,S,S,0,S,S,S,4,15,30,4,4,4,4,4,4,4,1,10630
ABW28082CH,4,1,1,2,0,1,0,1,0,0,3.3,0,0,0,0,0,0,1,88,0,1,1,1,1,1,1,20,1,1,0,U,1,0,U,1,0,U,1,1,1,0,0,0,0,0,0,0,1,1,1,0,1,6.25,1,0,1,1,1,0,4.4,1,2,1,0,0,0,0,0,0,0,0,0,0,1,0,0,0,0,0,0,1,1,1,0,1,0,0,1,1,1,1,0,0,0,0,1,3,1,S,S,S,S,S,S,S,S,S,1,3,3,3,1,2,S,S,S,S,S,S,S,S,S,S,S,S,S,S,S,S,S,S,S,S,S,S,S,S,S,S,S,S,S,S,S,S,S,S,S,S,S,S,S,30,20,0,0,S,0,S,4,0,S,2,2,2,2,2,1,1,1,1,1,1,1,1,1,1,1,1,1,1,1,1,S,S,S,S,S,S,0,S,S,S,3,0,10,1,2,2,2,1,1,1,2,10230
ACB78560DR,1,1,1,2,0,0,1,0,0,0,2.7,1,0,0,1,0,0,0,81,0,1,1,1,0,0,0,0,0,0,1,1,0,30,30,0,0,U,1,0,5,0,0,0,0,0,0,0,1,2,0,1,0,5.166666667,1,0,1,1,1,3,U,1,1,S,S,S,S,S,S,S,S,S,S,S,S,1,0,0,0,0,0,0,0,0,0,0,0,0,0,0,0,0,0,0,0,1,2,S,S,S,S,S,S,S,S,S,S,S,2,2,3,2,2,S,S,S,S,S,S,S,S,S,S,S,S,S,S,S,S,S,S,S,S,S,S,S,S,S,S,S,S,S,S,S,S,S,S,S,S,S,S,S,S,0,S,0,0,S,0,S,1,0,S,1,2,2,2,2,1,2,5,1,2,1,5,1,1,1,1,1,1,1,1,5,1,1,S,S,90,30,0,S,S,S,3,3,30,3,4,4,4,1,2,1,1,10280
ACD92089ZY,1,1,1,2,0,1,0,0,0,1,2.9,1,0,0,1,0,0,0,400,0,1,1,1,1,1,1,4,1,1,0,U,1,0,U,1,0,U,1,1,1,0,0,0,0,0,0,0,1,1,1,0,0,5.166666667,1,0,1,1,1,0,19.44444444,1,1,S,S,S,S,S,S,S,S,S,S,S,S,1,0,0,0,0,0,1,1,1,0,1,0,1,1,1,1,1,1,0,0,0,1,4,1,S,S,S,S,S,S,S,S,S,1,3,3,3,1,S,S,S,S,S,S,S,S,S,S,S,S,S,S,S,S,S,S,S,S,S,S,S,S,S,S,S,S,S,S,S,S,S,S,S,S,S,S,S,S,4,4,0,0,S,0,S,2,0,S,1,2,2,2,2,2,1,1,1,1,1,1,1,1,1,1,1,1,1,1,5,S,S,S,S,S,S,0,S,S,S,2,0,0,1,1,1,3,1,1,2,1,10170
ACG59813YP,1,0,Z,2,Z,Z,Z,Z,Z,Z,Z,Z,Z,Z,Z,Z,Z,Z,Z,Z,Z,Z,Z,Z,Z,Z,Z,Z,Z,Z,Z,Z,Z,Z,Z,Z,Z,Z,Z,Z,Z,Z,Z,Z,Z,Z,Z,,Z,Z,Z,Z,,,,,,Z,Z,Z,Z,Z,Z,Z,Z,Z,Z,Z,Z,Z,Z,Z,Z,Z,Z,Z,Z,Z,Z,Z,Z,Z,Z,Z,Z,Z,Z,Z,Z,Z,Z,Z,Z,Z,Z,Z,Z,Z,Z,Z,Z,Z,Z,Z,Z,Z,Z,Z,Z,Z,Z,Z,Z,Z,Z,Z,Z,Z,Z,Z,Z,Z,Z,Z,Z,Z,Z,Z,Z,Z,Z,Z,Z,Z,Z,Z,Z,Z,Z,Z,Z,Z,Z,Z,Z,Z,Z,Z,Z,Z,Z,Z,Z,Z,Z,Z,Z,Z,Z,Z,Z,Z,Z,Z,Z,Z,Z,Z,Z,Z,Z,Z,Z,Z,Z,Z,Z,Z,Z,Z,Z,Z,Z,Z,Z,Z,Z,Z,Z,Z,Z,Z,Z,Z,Z,Z,Z,Z,Z,Z,Z,Z,Z,Z,10170
ACP13071HH,2,1,1,2,0,1,0,0,0,1,2.666666667,1,1,0,0,0,0,0,2195,0,1,1,1,1,1,1,90,1,1,0,U,1,0,U,1,0,U,1,1,1,0,0,0,0,0,0,0,0,1,1,0,0,6,1,0,1,1,1,0,5,1,1,S,S,S,S,S,S,S,S,S,S,S,S,0,1,0,0,0,0,1,1,1,1,1,1,1,1,1,0,1,1,1,1,0,1,2,1,S,S,S,S,S,S,S,S,S,1,3,3,3,1,S,S,S,S,S,S,S,S,S,S,S,S,S,S,S,S,S,S,S,S,S,S,S,S,S,S,S,S,S,S,S,S,S,S,S,S,S,S,S,S,90,90,90,0,S,0,S,4,0,S,2,1,2,2,2,1,1,1,1,1,1,1,1,1,1,1,1,1,1,1,5,S,S,S,S,S,S,0,S,S,S,3,30,20,1,1,1,1,1,1,1,1,10540
ADC34849CY,4,0,Z,2,Z,Z,Z,Z,Z,Z,Z,Z,Z,Z,Z,Z,Z,Z,Z,Z,Z,Z,Z,Z,Z,Z,Z,Z,Z,Z,Z,Z,Z,Z,Z,Z,Z,Z,Z,Z,Z,Z,Z,Z,Z,Z,Z,,Z,Z,Z,Z,,,,,,Z,Z,Z,Z,Z,Z,Z,Z,Z,Z,Z,Z,Z,Z,Z,Z,Z,Z,Z,Z,Z,Z,Z,Z,Z,Z,Z,Z,Z,Z,Z,Z,Z,Z,Z,Z,Z,Z,Z,Z,Z,Z,Z,Z,Z,Z,Z,Z,Z,Z,Z,Z,Z,Z,Z,Z,Z,Z,Z,Z,Z,Z,Z,Z,Z,Z,Z,Z,Z,Z,Z,Z,Z,Z,Z,Z,Z,Z,Z,Z,Z,Z,Z,Z,Z,Z,Z,Z,Z,Z,Z,Z,Z,Z,Z,Z,Z,Z,Z,Z,Z,Z,Z,Z,Z,Z,Z,Z,Z,Z,Z,Z,Z,Z,Z,Z,Z,Z,Z,Z,Z,Z,Z,Z,Z,Z,Z,Z,Z,Z,Z,Z,Z,Z,Z,Z,Z,Z,Z,Z,Z,Z,Z,Z,Z,Z,Z,10250
ADD16256FQ,2,1,2,2,0,1,1,0,0,0,2.833333333,1,1,0,0,0,0,0,93,0,1,1,1,0,0,1,6,1,1,0,U,1,0,U,1,0,U,1,1,1,0,0,0,0,0,0,1,0,1,1,0,0,5,2,1,0,1,0,0,8.333333333,1,1,S,S,S,S,S,S,S,S,S,S,S,S,0,1,0,0,0,0,1,1,0,0,1,1,1,1,1,0,0,0,0,0,0,1,6,S,0,0,0,0,0,0,0,1,0,1,3,3,3,1,S,S,S,S,S,S,S,S,S,S,S,S,S,S,S,S,S,S,S,S,S,S,S,S,S,S,S,S,S,S,S,S,S,S,S,S,S,S,S,S,9,6,0,0,S,0,S,1,6,3,2,1,2,2,2,1,1,1,1,1,1,1,1,1,1,1,1,1,1,3,5,S,S,S,S,S,S,0,S,S,S,4,7,15,2,2,2,3,3,1,1,1,10380
ADJ47896SW,1,0,Z,2,Z,Z,Z,Z,Z,Z,Z,Z,Z,Z,Z,Z,Z,Z,Z,Z,Z,Z,Z,Z,Z,Z,Z,Z,Z,Z,Z,Z,Z,Z,Z,Z,Z,Z,Z,Z,Z,Z,Z,Z,Z,Z,Z,,Z,Z,Z,Z,,,,,,Z,Z,Z,Z,Z,Z,Z,Z,Z,Z,Z,Z,Z,Z,Z,Z,Z,Z,Z,Z,Z,Z,Z,Z,Z,Z,Z,Z,Z,Z,Z,Z,Z,Z,Z,Z,Z,Z,Z,Z,Z,Z,Z,Z,Z,Z,Z,Z,Z,Z,Z,Z,Z,Z,Z,Z,Z,Z,Z,Z,Z,Z,Z,Z,Z,Z,Z,Z,Z,Z,Z,Z,Z,Z,Z,Z,Z,Z,Z,Z,Z,Z,Z,Z,Z,Z,Z,Z,Z,Z,Z,Z,Z,Z,Z,Z,Z,Z,Z,Z,Z,Z,Z,Z,Z,Z,Z,Z,Z,Z,Z,Z,Z,Z,Z,Z,Z,Z,Z,Z,Z,Z,Z,Z,Z,Z,Z,Z,Z,Z,Z,Z,Z,Z,Z,Z,Z,Z,Z,Z,Z,Z,Z,Z,Z,Z,Z,10310
ADP44488BR,1,1,1,2,0,1,0,0,0,1,2.933333333,1,0,0,1,0,0,0,427,0,1,1,1,0,0,1,30,0,0,U,U,0,25,25,0,0,U,1,1,1,0,0,0,0,0,0,0,1,1,1,0,1,4.416666667,2,1,0,1,1,0,37.5,1,1,S,S,S,S,S,S,S,S,S,S,S,S,1,0,0,0,0,0,0,0,0,0,0,0,0,0,0,0,0,0,0,0,1,2,S,S,S,S,S,S,S,S,S,S,S,1,3,3,3,1,S,S,S,S,S,S,S,S,S,S,S,S,S,S,S,S,S,S,S,S,S,S,S,S,S,S,S,S,S,S,S,S,S,S,S,S,S,S,S,S,70,30,0,0,S,0,S,1,0,S,1,2,2,2,2,1,2,1,1,1,1,5,1,4,1,1,1,1,1,2,5,S,S,S,S,80,25,0,S,S,S,4,5,10,3,3,3,2,3,4,2,2,10520
ADY98016YV,1,0,Z,2,Z,Z,Z,Z,Z,Z,Z,Z,Z,Z,Z,Z,Z,Z,Z,Z,Z,Z,Z,Z,Z,Z,Z,Z,Z,Z,Z,Z,Z,Z,Z,Z,Z,Z,Z,Z,Z,Z,Z,Z,Z,Z,Z,,Z,Z,Z,Z,,,,,,Z,Z,Z,Z,Z,Z,Z,Z,Z,Z,Z,Z,Z,Z,Z,Z,Z,Z,Z,Z,Z,Z,Z,Z,Z,Z,Z,Z,Z,Z,Z,Z,Z,Z,Z,Z,Z,Z,Z,Z,Z,Z,Z,Z,Z,Z,Z,Z,Z,Z,Z,Z,Z,Z,Z,Z,Z,Z,Z,Z,Z,Z,Z,Z,Z,Z,Z,Z,Z,Z,Z,Z,Z,Z,Z,Z,Z,Z,Z,Z,Z,Z,Z,Z,Z,Z,Z,Z,Z,Z,Z,Z,Z,Z,Z,Z,Z,Z,Z,Z,Z,Z,Z,Z,Z,Z,Z,Z,Z,Z,Z,Z,Z,Z,Z,Z,Z,Z,Z,Z,Z,Z,Z,Z,Z,Z,Z,Z,Z,Z,Z,Z,Z,Z,Z,Z,Z,Z,Z,Z,Z,Z,Z,Z,Z,Z,Z,10250
ADZ78813NX,2,1,1,2,0,0,1,0,0,0,3.3,1,1,0,0,0,0,0,99,0,1,1,1,1,0,1,3,1,1,0,U,1,0,U,1,0,U,1,1,1,0,0,0,0,0,0,0,1,2,0,1,0,3.166666667,2,1,0,1,1,0,1.106382979,1,1,S,S,S,S,S,S,S,S,S,S,S,S,0,1,0,0,0,0,1,1,1,0,1,1,1,1,1,1,1,1,1,0,0,1,3,1,S,S,S,S,S,S,S,S,S,1,3,3,1,1,S,S,S,S,S,S,S,S,S,S,S,S,S,S,S,S,S,S,S,S,S,S,S,S,S,S,S,S,S,S,S,S,S,S,S,S,S,S,S,S,3,3,0,0,S,0,S,1,0,S,2,1,2,1,1,1,1,1,1,1,1,1,1,1,1,1,1,1,1,1,1,S,S,S,S,S,S,0,S,S,S,2,5,30,2,4,4,3,2,1,2,3,10670
AED95064UC,1,1,1,2,0,1,0,0,0,1,3.266666667,1,0,0,1,0,0,0,565,0,1,1,1,1,1,1,12,0,0,0,U,1,30,30,0,30,30,0,1,1,0,0,0,0,0,0,0,0,1,1,0,0,5.833333333,1,0,1,1,1,0,30,1,1,S,S,S,S,S,S,S,S,S,S,S,S,1,0,0,0,0,0,1,1,0,0,1,0,0,1,0,0,0,0,0,0,0,2,S,S,S,S,S,S,S,S,S,S,S,2,2,2,2,2,S,S,S,S,S,S,S,S,S,S,S,S,S,S,S,S,S,S,S,S,S,S,S,S,S,S,S,S,S,S,S,S,S,S,S,S,S,S,S,S,90,12,0,0,S,0,S,3,0,S,1,2,2,2,2,1,1,1,1,1,5,5,2,2,1,1,1,1,1,1,5,S,S,90,30,90,30,0,S,S,S,3,30,30,4,3,4,3,3,4,3,1,10490
AEG59367MV,1,1,1,2,0,0,1,0,0,0,2.766666667,1,0,0,1,0,0,0,83,0,1,1,0,0,0,1,3,1,1,0,U,1,0,U,1,0,U,1,1,1,0,0,0,0,0,0,0,0,1,1,0,0,5.416666667,1,0,1,1,1,0,28.31818182,1,1,S,S,S,S,S,S,S,S,S,S,S,S,1,0,0,0,0,0,1,0,0,0,1,0,1,1,0,0,0,0,1,0,0,2,S,S,S,S,S,S,S,S,S,S,S,2,3,2,2,2,S,S,S,S,S,S,S,S,S,S,S,S,S,S,S,S,S,S,S,S,S,S,S,S,S,S,S,S,S,S,S,S,S,S,S,S,S,S,S,S,90,3,0,0,S,0,S,1,0,S,1,2,2,2,2,1,1,1,1,1,1,1,1,4,1,1,1,1,1,1,5,S,S,S,S,S,S,0,S,S,S,5,2,2,2,2,3,2,2,2,3,2,10090
AEJ64890XF,2,1,1,2,0,1,0,0,0,1,2.6,1,1,0,0,0,0,0,1053,0,1,1,1,1,1,1,15,1,0,0,U,1,0,U,1,0,U,1,0,5,0,0,0,0,0,0,1,1,1,1,0,0,3.833333333,2,1,0,1,0,0,5,1,1,S,S,S,S,S,S,S,S,S,S,S,S,0,1,0,0,0,0,1,1,0,1,1,1,1,1,1,1,1,1,1,0,0,1,6,S,1,0,0,0,0,0,0,0,0,1,1,3,1,1,S,S,S,S,S,S,S,S,S,S,S,S,S,S,S,S,S,S,S,S,S,S,S,S,S,S,S,S,S,S,S,S,S,S,S,S,S,S,S,S,90,15,0,0,S,0,S,4,1,0,2,1,2,2,2,1,1,5,1,1,1,1,5,1,1,1,1,1,1,1,5,S,S,S,S,S,S,0,S,S,S,4,8,0,2,1,1,1,1,1,1,1,10540
AEQ99760NF,2,1,1,2,0,0,1,0,0,0,2.866666667,1,1,0,0,0,0,0,86,0,1,1,1,0,1,1,30,1,1,0,U,1,0,U,1,0,U,1,1,1,0,0,0,0,0,0,1,0,2,0,1,0,5.916666667,1,0,1,1,1,0,1.106382979,1,1,S,S,S,S,S,S,S,S,S,S,S,S,0,1,0,0,0,0,1,1,1,1,0,0,0,1,1,1,1,1,1,0,0,1,6,S,0,0,0,0,0,1,0,0,0,1,3,3,3,1,S,S,S,S,S,S,S,S,S,S,S,S,S,S,S,S,S,S,S,S,S,S,S,S,S,S,S,S,S,S,S,S,S,S,S,S,S,S,S,S,30,30,0,0,S,0,S,3,2,0,2,1,2,2,2,1,1,1,1,1,1,1,1,2,1,1,1,1,1,1,1,S,S,S,S,S,S,0,S,S,S,2,0,5,2,1,2,1,2,1,1,1,10670
AEX19357JP,2,1,1,2,0,1,0,1,0,0,2.833333333,1,1,0,0,0,0,0,134,0,1,1,1,1,1,1,14,1,1,0,U,1,0,U,1,0,U,1,1,1,0,0,0,0,0,0,1,1,2,0,1,1,3.833333333,2,1,0,1,1,0,1.106382979,1,1,S,S,S,S,S,S,S,S,S,S,S,S,0,1,0,0,0,0,1,1,0,0,1,1,1,1,0,1,1,1,1,1,0,1,1,4,S,S,S,S,S,S,S,S,S,2,1,3,3,1,S,S,S,S,S,S,S,S,S,S,S,S,S,S,S,S,S,S,S,S,S,S,S,S,S,S,S,S,S,S,S,S,S,S,S,S,S,S,S,S,14,14,0,0,S,0,S,4,1,0,2,1,2,2,2,1,1,1,1,1,1,1,1,1,1,1,1,1,1,1,5,S,S,S,S,S,S,0,S,S,S,2,0,0,1,1,1,1,1,1,1,1,10670
AEX80215GK,1,0,Z,2,Z,Z,Z,Z,Z,Z,Z,Z,Z,Z,Z,Z,Z,Z,Z,Z,Z,Z,Z,Z,Z,Z,Z,Z,Z,Z,Z,Z,Z,Z,Z,Z,Z,Z,Z,Z,Z,Z,Z,Z,Z,Z,Z,,Z,Z,Z,Z,,,,,,Z,Z,Z,Z,Z,Z,Z,Z,Z,Z,Z,Z,Z,Z,Z,Z,Z,Z,Z,Z,Z,Z,Z,Z,Z,Z,Z,Z,Z,Z,Z,Z,Z,Z,Z,Z,Z,Z,Z,Z,Z,Z,Z,Z,Z,Z,Z,Z,Z,Z,Z,Z,Z,Z,Z,Z,Z,Z,Z,Z,Z,Z,Z,Z,Z,Z,Z,Z,Z,Z,Z,Z,Z,Z,Z,Z,Z,Z,Z,Z,Z,Z,Z,Z,Z,Z,Z,Z,Z,Z,Z,Z,Z,Z,Z,Z,Z,Z,Z,Z,Z,Z,Z,Z,Z,Z,Z,Z,Z,Z,Z,Z,Z,Z,Z,Z,Z,Z,Z,Z,Z,Z,Z,Z,Z,Z,Z,Z,Z,Z,Z,Z,Z,Z,Z,Z,Z,Z,Z,Z,Z,Z,Z,Z,Z,Z,Z,10250
AFG29673QH,2,1,1,2,0,1,0,0,0,1,3.166666667,1,1,0,0,0,0,0,1195,0,1,1,0,0,0,1,3,1,1,0,U,1,0,U,1,0,U,1,1,1,0,0,0,0,0,0,1,0,1,1,0,0,5.833333333,1,0,1,1,1,0,8.333333333,1,1,S,S,S,S,S,S,S,S,S,S,S,S,0,1,0,0,0,0,1,0,0,0,1,1,1,1,0,0,1,1,1,0,0,2,S,S,S,S,S,S,S,S,S,S,S,1,1,1,2,2,S,S,S,S,S,S,S,S,S,S,S,S,S,S,S,S,S,S,S,S,S,S,S,S,S,S,S,S,S,S,S,S,S,S,S,S,S,S,S,S,3,3,0,0,S,0,S,1,4,1,2,1,2,2,2,1,1,1,1,1,1,1,1,1,1,1,1,1,1,1,5,S,S,S,S,S,S,0,S,S,S,2,2,2,1,1,2,2,2,2,1,1,10380
AFK46748MZ,2,0,Z,2,Z,Z,Z,Z,Z,Z,Z,Z,Z,Z,Z,Z,Z,Z,Z,Z,Z,Z,Z,Z,Z,Z,Z,Z,Z,Z,Z,Z,Z,Z,Z,Z,Z,Z,Z,Z,Z,Z,Z,Z,Z,Z,Z,,Z,Z,Z,Z,,,,,,Z,Z,Z,Z,Z,Z,Z,Z,Z,Z,Z,Z,Z,Z,Z,Z,Z,Z,Z,Z,Z,Z,Z,Z,Z,Z,Z,Z,Z,Z,Z,Z,Z,Z,Z,Z,Z,Z,Z,Z,Z,Z,Z,Z,Z,Z,Z,Z,Z,Z,Z,Z,Z,Z,Z,Z,Z,Z,Z,Z,Z,Z,Z,Z,Z,Z,Z,Z,Z,Z,Z,Z,Z,Z,Z,Z,Z,Z,Z,Z,Z,Z,Z,Z,Z,Z,Z,Z,Z,Z,Z,Z,Z,Z,Z,Z,Z,Z,Z,Z,Z,Z,Z,Z,Z,Z,Z,Z,Z,Z,Z,Z,Z,Z,Z,Z,Z,Z,Z,Z,Z,Z,Z,Z,Z,Z,Z,Z,Z,Z,Z,Z,Z,Z,Z,Z,Z,Z,Z,Z,Z,Z,Z,Z,Z,Z,Z,10460
AFY61285HP,1,1,1,2,0,1,1,0,0,0,2.7,1,0,0,1,0,0,0,94,0,1,1,1,1,1,1,15,1,0,0,U,1,0,U,1,0,U,1,0,5,0,0,0,0,0,0,1,1,1,1,0,0,7,1,0,1,1,1,3,U,1,1,S,S,S,S,S,S,S,S,S,S,S,S,1,0,0,0,0,0,1,1,1,1,1,1,1,1,1,1,1,1,1,1,0,1,4,1,S,S,S,S,S,S,S,S,S,1,2,2,2,1,S,S,S,S,S,S,S,S,S,S,S,S,S,S,S,S,S,S,S,S,S,S,S,S,S,S,S,S,S,S,S,S,S,S,S,S,S,S,S,S,90,15,90,0,S,0,S,3,1,0,1,2,2,2,2,1,1,5,1,1,1,1,1,1,1,1,1,1,1,1,5,S,S,S,S,S,S,0,S,S,S,5,30,10,3,4,2,4,1,4,3,1,10280
AGB55569HX,1,1,1,2,0,0,1,0,0,0,3.033333333,1,0,0,1,0,0,0,91,0,0,1,0,1,0,1,3,1,0,0,U,0,0,U,1,0,U,1,0,5,0,0,0,0,0,0,0,1,1,1,0,1,5.5,1,0,1,1,1,0,80.25,1,1,S,S,S,S,S,S,S,S,S,S,S,S,1,0,0,0,0,0,1,0,0,0,0,0,0,1,1,0,0,0,0,0,0,1,2,2,S,S,S,S,S,S,S,S,S,2,2,3,3,2,S,S,S,S,S,S,S,S,S,S,S,S,S,S,S,S,S,S,S,S,S,S,S,S,S,S,S,S,S,S,S,S,S,S,S,S,S,S,S,S,86,3,0,0,S,0,S,1,0,S,1,2,2,2,2,1,4,5,1,1,1,1,1,5,1,4,1,1,1,1,5,0,S,S,S,S,S,0,S,S,S,3,2,15,2,4,2,3,3,3,4,3,10500
AGD80532KK,2,0,Z,2,Z,Z,Z,Z,Z,Z,Z,Z,Z,Z,Z,Z,Z,Z,Z,Z,Z,Z,Z,Z,Z,Z,Z,Z,Z,Z,Z,Z,Z,Z,Z,Z,Z,Z,Z,Z,Z,Z,Z,Z,Z,Z,Z,,Z,Z,Z,Z,,,,,,Z,Z,Z,Z,Z,Z,Z,Z,Z,Z,Z,Z,Z,Z,Z,Z,Z,Z,Z,Z,Z,Z,Z,Z,Z,Z,Z,Z,Z,Z,Z,Z,Z,Z,Z,Z,Z,Z,Z,Z,Z,Z,Z,Z,Z,Z,Z,Z,Z,Z,Z,Z,Z,Z,Z,Z,Z,Z,Z,Z,Z,Z,Z,Z,Z,Z,Z,Z,Z,Z,Z,Z,Z,Z,Z,Z,Z,Z,Z,Z,Z,Z,Z,Z,Z,Z,Z,Z,Z,Z,Z,Z,Z,Z,Z,Z,Z,Z,Z,Z,Z,Z,Z,Z,Z,Z,Z,Z,Z,Z,Z,Z,Z,Z,Z,Z,Z,Z,Z,Z,Z,Z,Z,Z,Z,Z,Z,Z,Z,Z,Z,Z,Z,Z,Z,Z,Z,Z,Z,Z,Z,Z,Z,Z,Z,Z,Z,10460
AGE39447KN,1,1,1,2,0,1,0,0,0,1,2.833333333,1,0,0,1,0,0,0,2016,0,1,1,1,0,1,1,15,1,1,0,U,1,0,U,1,0,U,1,1,1,0,0,0,0,0,0,1,0,1,1,0,0,4.75,2,1,0,1,1,0,26.27777778,1,1,S,S,S,S,S,S,S,S,S,S,S,S,1,0,0,0,0,0,1,1,1,0,1,1,0,1,1,1,0,1,0,0,0,2,S,S,S,S,S,S,S,S,S,S,S,1,3,3,3,1,S,S,S,S,S,S,S,S,S,S,S,S,S,S,S,S,S,S,S,S,S,S,S,S,S,S,S,S,S,S,S,S,S,S,S,S,S,S,S,S,90,15,0,0,S,0,S,4,5,0,1,2,2,2,2,1,1,1,1,1,1,1,1,1,2,1,1,1,1,2,5,S,S,S,S,S,S,0,S,S,S,2,0,1,1,1,2,1,1,1,1,1,10130
AGF26509DU,1,1,1,2,0,1,0,0,0,1,3.266666667,0,0,0,0,0,0,1,1714,0,1,1,1,1,0,1,4,1,1,0,U,1,0,U,1,0,U,1,1,1,0,0,0,0,0,0,1,0,1,1,0,1,6,1,0,1,1,0,0,27.27272727,1,2,2,0,0,0,0,0,0,0,0,0,0,1,1,0,0,0,0,0,1,1,0,0,0,0,0,0,0,0,0,0,0,0,0,1,2,1,S,S,S,S,S,S,S,S,S,2,2,2,2,2,2,S,S,S,S,S,S,S,S,S,S,S,S,S,S,S,S,S,S,S,S,S,S,S,S,S,S,S,S,S,S,S,S,S,S,S,S,S,S,S,60,4,0,0,S,0,S,1,2,0,1,2,2,2,2,1,1,1,1,1,1,1,1,1,1,1,1,1,1,2,2,S,S,S,S,S,S,0,S,S,S,3,0,0,1,1,1,2,1,1,2,1,10270
AGF78587AN,1,0,Z,2,Z,Z,Z,Z,Z,Z,Z,Z,Z,Z,Z,Z,Z,Z,Z,Z,Z,Z,Z,Z,Z,Z,Z,Z,Z,Z,Z,Z,Z,Z,Z,Z,Z,Z,Z,Z,Z,Z,Z,Z,Z,Z,Z,,Z,Z,Z,Z,,,,,,Z,Z,Z,Z,Z,Z,Z,Z,Z,Z,Z,Z,Z,Z,Z,Z,Z,Z,Z,Z,Z,Z,Z,Z,Z,Z,Z,Z,Z,Z,Z,Z,Z,Z,Z,Z,Z,Z,Z,Z,Z,Z,Z,Z,Z,Z,Z,Z,Z,Z,Z,Z,Z,Z,Z,Z,Z,Z,Z,Z,Z,Z,Z,Z,Z,Z,Z,Z,Z,Z,Z,Z,Z,Z,Z,Z,Z,Z,Z,Z,Z,Z,Z,Z,Z,Z,Z,Z,Z,Z,Z,Z,Z,Z,Z,Z,Z,Z,Z,Z,Z,Z,Z,Z,Z,Z,Z,Z,Z,Z,Z,Z,Z,Z,Z,Z,Z,Z,Z,Z,Z,Z,Z,Z,Z,Z,Z,Z,Z,Z,Z,Z,Z,Z,Z,Z,Z,Z,Z,Z,Z,Z,Z,Z,Z,Z,Z,10090
AGX39214GC,2,1,1,2,0,1,0,1,0,0,2.833333333,1,1,0,0,0,0,0,142,0,1,1,1,0,0,1,12,1,1,0,U,1,0,U,1,0,U,1,1,1,0,0,0,0,0,0,1,1,1,1,0,0,5.833333333,1,0,1,1,1,0,14.05263158,1,1,S,S,S,S,S,S,S,S,S,S,S,S,0,1,0,0,0,0,0,1,1,1,0,0,0,0,1,1,0,0,0,0,0,2,S,S,S,S,S,S,S,S,S,S,S,1,2,3,2,2,S,S,S,S,S,S,S,S,S,S,S,S,S,S,S,S,S,S,S,S,S,S,S,S,S,S,S,S,S,S,S,S,S,S,S,S,S,S,S,S,12,12,0,0,S,0,S,1,1,0,2,1,2,1,2,2,1,1,1,1,1,1,5,2,1,1,1,1,1,1,5,S,S,S,S,S,S,0,S,S,S,4,5,5,2,2,3,2,3,3,2,2,10460
AHR27502XZ,2,1,1,2,0,1,0,0,0,1,2.333333333,1,1,0,0,0,0,0,3470,0,1,1,1,0,0,0,0,1,0,0,U,1,0,U,0,0,U,1,1,1,0,0,0,0,0,0,1,1,1,1,0,1,7,1,0,1,1,1,0,22.27272727,1,1,S,S,S,S,S,S,S,S,S,S,S,S,0,1,0,0,0,0,1,1,1,0,1,1,1,1,1,0,0,0,1,0,0,2,S,S,S,S,S,S,S,S,S,S,S,2,3,3,2,2,S,S,S,S,S,S,S,S,S,S,S,S,S,S,S,S,S,S,S,S,S,S,S,S,S,S,S,S,S,S,S,S,S,S,S,S,S,S,S,S,0,S,0,0,S,0,S,1,1,0,2,1,2,2,2,1,1,1,1,1,1,2,1,1,1,1,1,1,1,1,5,S,S,S,S,0,S,0,S,S,S,2,0,0,2,1,2,2,1,1,1,1,10180
AJD71927MZ,1,1,1,2,0,1,0,0,0,1,2.333333333,1,0,0,1,0,0,0,684,0,1,1,0,1,0,1,3,1,1,0,U,1,0,U,1,0,U,1,1,1,0,0,0,0,0,0,0,1,2,0,1,1,4.333333333,2,1,0,1,1,0,19.06896552,1,1,S,S,S,S,S,S,S,S,S,S,S,S,1,0,0,0,0,0,1,0,0,0,0,1,1,1,0,0,0,0,0,0,0,1,2,1,S,S,S,S,S,S,S,S,S,1,3,3,3,1,S,S,S,S,S,S,S,S,S,S,S,S,S,S,S,S,S,S,S,S,S,S,S,S,S,S,S,S,S,S,S,S,S,S,S,S,S,S,S,S,90,3,0,0,S,0,S,1,0,S,1,2,2,2,2,1,1,1,1,1,1,1,1,5,1,1,1,1,1,1,5,S,S,S,S,S,S,0,S,S,S,2,0,0,2,2,3,1,2,2,2,1,10250
AJH10610SK,1,1,1,2,0,0,1,0,0,0,3.2,1,0,0,1,0,0,0,96,0,0,1,0,0,1,1,2,1,1,0,U,1,0,U,1,0,U,1,1,1,0,0,0,0,0,0,0,0,2,0,1,1,2.25,3,1,1,0,1,0,28.31818182,1,1,S,S,S,S,S,S,S,S,S,S,S,S,1,0,0,0,0,0,1,0,1,0,0,0,0,1,0,0,0,0,0,0,0,3,S,S,S,S,S,S,S,S,S,S,S,2,2,2,2,2,S,S,S,S,S,S,S,S,S,S,S,S,S,S,S,S,S,S,S,S,S,S,S,S,S,S,S,S,S,S,S,S,S,S,S,S,S,S,S,S,90,2,1,0,S,0,S,2,0,S,1,2,2,2,2,1,1,1,1,1,1,1,1,1,1,1,1,1,1,2,5,S,S,S,S,S,S,0,S,S,S,4,1,0,2,2,2,2,2,1,2,2,10090
AJM18722UG,2,1,1,2,0,0,1,0,0,0,2.566666667,0,0,0,0,0,0,1,2,1,1,0,0,0,0,0,0,U,0,U,U,0,0,U,1,0,U,1,1,1,0,0,0,0,0,0,1,1,1,1,0,0,1.916666667,3,1,1,0,1,0,2.818181818,2,S,S,S,S,S,S,S,S,S,S,S,S,S,S,S,S,S,S,S,S,S,S,S,S,S,S,S,S,S,S,S,S,S,S,S,S,S,S,S,S,S,S,S,S,S,S,S,S,S,S,S,S,S,S,S,S,S,S,S,S,S,S,S,S,S,S,S,S,S,S,S,S,S,S,S,S,S,S,S,S,S,S,S,S,S,S,S,S,S,S,S,3,0,0,0,S,0,S,1,6,6,2,1,2,2,2,2,4,1,1,1,1,1,1,1,1,1,1,1,1,1,1,S,S,S,S,S,S,0,S,S,S,4,30,20,3,3,4,4,3,2,4,3,10590
AJU32199NR,1,1,1,2,0,1,1,0,0,0,2.333333333,1,0,0,1,0,0,0,80,0,1,1,1,0,1,1,20,0,0,0,U,1,15,15,0,0,U,1,1,1,0,0,0,0,0,0,1,0,1,1,0,1,7,1,0,1,1,0,3,U,1,1,S,S,S,S,S,S,S,S,S,S,S,S,1,0,0,0,0,0,1,1,0,0,1,0,1,1,0,0,0,1,1,0,0,1,1,2,S,S,S,S,S,S,S,S,S,1,3,3,3,1,S,S,S,S,S,S,S,S,S,S,S,S,S,S,S,S,S,S,S,S,S,S,S,S,S,S,S,S,S,S,S,S,S,S,S,S,S,S,S,S,90,20,0,0,S,0,S,2,3,0,1,2,2,2,2,1,1,1,1,1,1,4,1,2,1,1,1,1,1,2,5,S,S,S,S,60,15,0,S,S,S,3,0,10,1,2,2,2,1,3,1,1,10280
AJZ36706SA,1,1,1,2,0,0,1,0,0,0,3.033333333,1,0,0,1,0,0,0,91,0,0,1,1,0,0,1,7,0,0,0,U,1,0,U,1,5,5,0,1,1,0,0,0,0,0,0,0,0,1,1,0,0,5,2,1,0,1,1,3,U,1,1,S,S,S,S,S,S,S,S,S,S,S,S,1,0,0,0,0,0,1,1,0,0,0,0,0,1,1,0,0,0,0,0,0,2,S,S,S,S,S,S,S,S,S,S,S,2,2,3,2,2,S,S,S,S,S,S,S,S,S,S,S,S,S,S,S,S,S,S,S,S,S,S,S,S,S,S,S,S,S,S,S,S,S,S,S,S,S,S,S,S,90,7,0,0,S,0,S,1,0,S,1,2,2,2,2,1,1,1,1,1,2,1,1,2,1,1,1,1,1,1,4,S,S,10,5,S,S,0,S,S,S,3,3,2,1,2,1,1,1,1,1,1,10280
AKA28525XD,2,1,1,2,0,0,1,0,0,0,3.5,1,1,0,0,0,0,0,105,0,1,1,0,0,0,1,3,1,1,0,U,1,0,U,1,0,U,1,1,1,0,0,0,0,0,0,1,1,1,1,0,0,7,1,0,1,1,1,0,8.333333333,1,1,S,S,S,S,S,S,S,S,S,S,S,S,0,1,0,0,0,0,1,0,1,0,1,1,1,1,0,0,0,0,0,0,0,2,S,S,S,S,S,S,S,S,S,S,S,1,2,3,2,2,S,S,S,S,S,S,S,S,S,S,S,S,S,S,S,S,S,S,S,S,S,S,S,S,S,S,S,S,S,S,S,S,S,S,S,S,S,S,S,S,90,3,0,0,S,0,S,1,3,3,2,1,2,2,2,1,1,1,1,1,1,1,1,1,1,1,1,1,1,N,5,S,S,S,S,S,S,0,S,S,S,3,0,15,3,3,3,3,1,3,3,3,10380
AKD59210YQ,1,1,1,2,0,0,1,0,0,0,2.566666667,1,0,0,1,0,0,0,77,0,0,1,1,0,1,1,7,0,0,0,U,0,2,2,0,9,9,0,0,5,0,0,0,0,0,0,1,0,1,1,0,0,4.833333333,2,1,0,1,1,0,27.27272727,1,1,S,S,S,S,S,S,S,S,S,S,S,S,1,0,0,0,0,0,0,0,0,0,0,0,0,0,0,0,0,0,0,0,1,2,S,S,S,S,S,S,S,S,S,S,S,1,3,3,2,1,S,S,S,S,S,S,S,S,S,S,S,S,S,S,S,S,S,S,S,S,S,S,S,S,S,S,S,S,S,S,S,S,S,S,S,S,S,S,S,S,90,7,0,0,S,0,S,2,2,0,1,2,2,2,2,1,2,5,1,1,2,2,1,1,1,1,1,1,1,1,5,2,0,40,9,12,2,0,S,S,S,2,1,1,2,2,1,2,1,1,1,1,10270
AKT52475KW,2,1,1,2,0,1,1,0,0,0,4.266666667,1,1,0,0,0,0,0,140,0,1,1,1,1,0,1,1,1,0,0,U,0,0,U,0,0,U,0,0,4,0,0,0,0,0,0,1,0,2,0,1,0,4,2,1,0,1,1,0,1.106382979,1,1,S,S,S,S,S,S,S,S,S,S,S,S,0,0,0,1,0,0,0,0,0,0,0,1,0,0,0,0,0,0,0,0,0,1,5,1,S,S,S,S,S,S,S,S,S,1,1,1,1,1,S,S,S,S,S,S,S,S,S,S,S,S,S,S,S,S,S,S,S,S,S,S,S,S,S,S,S,S,S,S,S,S,S,S,S,S,S,S,S,S,80,1,70,0,S,0,S,1,1,0,2,1,2,2,2,1,5,4,5,5,5,5,5,5,5,5,5,5,5,5,5,0,S,0,S,0,S,0,S,S,S,2,0,0,1,1,1,1,1,1,1,1,10670
AMN82633FB,2,0,Z,2,Z,Z,Z,Z,Z,Z,Z,Z,Z,Z,Z,Z,Z,Z,Z,Z,Z,Z,Z,Z,Z,Z,Z,Z,Z,Z,Z,Z,Z,Z,Z,Z,Z,Z,Z,Z,Z,Z,Z,Z,Z,Z,Z,,Z,Z,Z,Z,,,,,,Z,Z,Z,Z,Z,Z,Z,Z,Z,Z,Z,Z,Z,Z,Z,Z,Z,Z,Z,Z,Z,Z,Z,Z,Z,Z,Z,Z,Z,Z,Z,Z,Z,Z,Z,Z,Z,Z,Z,Z,Z,Z,Z,Z,Z,Z,Z,Z,Z,Z,Z,Z,Z,Z,Z,Z,Z,Z,Z,Z,Z,Z,Z,Z,Z,Z,Z,Z,Z,Z,Z,Z,Z,Z,Z,Z,Z,Z,Z,Z,Z,Z,Z,Z,Z,Z,Z,Z,Z,Z,Z,Z,Z,Z,Z,Z,Z,Z,Z,Z,Z,Z,Z,Z,Z,Z,Z,Z,Z,Z,Z,Z,Z,Z,Z,Z,Z,Z,Z,Z,Z,Z,Z,Z,Z,Z,Z,Z,Z,Z,Z,Z,Z,Z,Z,Z,Z,Z,Z,Z,Z,Z,Z,Z,Z,Z,Z,10560
AMP83420CG,2,1,1,2,1,1,0,0,0,1,4.6,1,1,0,0,0,0,0,2084,0,1,1,0,0,1,0,0,1,1,0,U,1,0,U,1,0,U,1,1,1,0,0,0,0,0,0,1,1,1,1,0,0,7,1,0,1,1,1,0,8.866666667,1,1,S,S,S,S,S,S,S,S,S,S,S,S,0,1,0,0,0,0,1,0,0,0,1,1,1,1,0,0,1,1,1,0,0,1,6,S,0,1,0,0,0,0,0,0,0,1,2,3,2,1,S,S,S,S,S,S,S,S,S,S,S,S,S,S,S,S,S,S,S,S,S,S,S,S,S,S,S,S,S,S,S,S,S,S,S,S,S,S,S,S,0,S,0,0,S,0,S,3,3,0,2,1,2,2,2,1,1,1,1,1,1,1,1,1,1,5,1,1,1,1,5,S,S,S,S,S,S,0,S,S,S,3,3,5,2,2,4,3,1,2,4,1,10290
AMX18222GV,1,1,1,2,0,1,0,0,0,1,2.7,1,0,0,1,0,0,0,312,0,1,1,1,0,0,0,0,1,1,0,U,1,0,U,1,0,U,1,1,1,0,0,0,0,0,0,0,1,1,1,0,0,6,1,0,1,1,1,0,34.81818182,1,1,S,S,S,S,S,S,S,S,S,S,S,S,1,0,0,0,0,0,1,1,1,1,1,0,1,1,1,1,0,0,1,0,0,2,S,S,S,S,S,S,S,S,S,S,S,2,3,1,1,1,S,S,S,S,S,S,S,S,S,S,S,S,S,S,S,S,S,S,S,S,S,S,S,S,S,S,S,S,S,S,S,S,S,S,S,S,S,S,S,S,90,0,0,0,S,0,S,1,0,S,2,2,2,2,2,2,1,1,1,1,1,1,1,1,1,1,1,1,2,2,2,S,S,S,S,S,S,0,S,S,S,3,0,0,1,1,1,1,1,1,1,1,10480
ANC66030YP,1,1,1,2,0,1,0,0,0,1,2.6,1,0,0,1,0,0,0,474,0,1,1,1,1,0,1,15,1,1,0,U,1,0,U,1,0,U,1,1,1,0,0,0,0,0,0,1,1,1,1,0,0,5.833333333,1,0,1,1,1,0,21.30769231,1,1,S,S,S,S,S,S,S,S,S,S,S,S,1,0,0,0,0,0,1,1,0,0,1,1,1,1,0,1,0,1,1,0,0,1,3,1,S,S,S,S,S,S,S,S,S,1,3,3,3,1,S,S,S,S,S,S,S,S,S,S,S,S,S,S,S,S,S,S,S,S,S,S,S,S,S,S,S,S,S,S,S,S,S,S,S,S,S,S,S,S,65,15,0,0,S,0,S,1,1,0,1,2,2,2,2,1,1,1,1,1,1,1,1,1,1,1,1,1,1,1,5,S,S,S,S,S,S,0,S,S,S,3,0,5,1,2,4,2,1,1,1,1,10300
AND71138NG,2,0,Z,2,Z,Z,Z,Z,Z,Z,Z,Z,Z,Z,Z,Z,Z,Z,Z,Z,Z,Z,Z,Z,Z,Z,Z,Z,Z,Z,Z,Z,Z,Z,Z,Z,Z,Z,Z,Z,Z,Z,Z,Z,Z,Z,Z,,Z,Z,Z,Z,,,,,,Z,Z,Z,Z,Z,Z,Z,Z,Z,Z,Z,Z,Z,Z,Z,Z,Z,Z,Z,Z,Z,Z,Z,Z,Z,Z,Z,Z,Z,Z,Z,Z,Z,Z,Z,Z,Z,Z,Z,Z,Z,Z,Z,Z,Z,Z,Z,Z,Z,Z,Z,Z,Z,Z,Z,Z,Z,Z,Z,Z,Z,Z,Z,Z,Z,Z,Z,Z,Z,Z,Z,Z,Z,Z,Z,Z,Z,Z,Z,Z,Z,Z,Z,Z,Z,Z,Z,Z,Z,Z,Z,Z,Z,Z,Z,Z,Z,Z,Z,Z,Z,Z,Z,Z,Z,Z,Z,Z,Z,Z,Z,Z,Z,Z,Z,Z,Z,Z,Z,Z,Z,Z,Z,Z,Z,Z,Z,Z,Z,Z,Z,Z,Z,Z,Z,Z,Z,Z,Z,Z,Z,Z,Z,Z,Z,Z,Z,10250
ANH62331PP,1,1,1,2,0,1,0,0,0,1,2.933333333,1,0,0,1,0,0,0,1471,0,1,1,0,0,0,1,5,1,1,0,U,1,0,U,1,0,U,1,1,1,0,0,0,0,0,0,1,0,1,1,0,0,4.833333333,2,1,0,1,1,0,80.25,1,1,S,S,S,S,S,S,S,S,S,S,S,S,1,0,0,0,0,0,1,0,0,0,0,0,0,0,0,0,1,0,0,0,0,2,S,S,S,S,S,S,S,S,S,S,S,1,1,3,2,2,S,S,S,S,S,S,S,S,S,S,S,S,S,S,S,S,S,S,S,S,S,S,S,S,S,S,S,S,S,S,S,S,S,S,S,S,S,S,S,S,90,5,0,0,S,0,S,1,2,0,1,2,2,2,1,1,1,1,1,1,1,1,1,5,1,4,1,1,1,3,5,S,S,S,S,S,S,0,S,S,S,3,0,0,2,2,4,2,3,2,4,2,10500
APB53483MQ,1,1,1,2,0,1,0,0,0,1,3.9,1,0,0,1,0,0,0,1193,0,0,1,1,1,0,1,10,1,1,0,U,1,0,U,1,0,U,1,1,1,0,0,1,0,0,0,1,1,1,1,0,0,3.416666667,2,1,0,1,1,0,19.44444444,1,1,S,S,S,S,S,S,S,S,S,S,S,S,1,0,0,0,0,1,1,1,1,0,1,0,0,1,0,1,0,0,1,0,0,1,3,2,S,S,S,S,S,S,S,S,S,1,3,2,3,1,S,S,S,S,S,S,S,S,S,S,S,S,S,S,S,S,S,S,S,S,S,S,S,S,S,S,S,S,S,S,S,S,S,S,S,S,S,S,S,S,90,10,0,0,S,3,0,1,2,0,1,2,1,2,2,1,1,1,1,1,1,1,1,1,1,1,1,1,1,1,5,S,S,S,S,S,S,0,S,S,S,3,30,15,2,3,3,3,3,2,3,1,10170
APC91162YA,1,1,1,2,0,1,0,0,0,1,3.033333333,1,0,0,1,0,0,0,309,0,1,1,1,0,0,1,6,0,0,0,U,1,12,12,0,12,12,0,1,1,0,0,0,0,0,0,0,0,1,1,0,1,7,1,0,1,1,1,0,37.5,1,1,S,S,S,S,S,S,S,S,S,S,S,S,1,0,0,0,0,0,1,1,0,0,0,1,1,1,0,0,0,1,0,0,0,3,S,S,S,S,S,S,S,S,S,S,S,1,3,3,3,1,S,S,S,S,S,S,S,S,S,S,S,S,S,S,S,S,S,S,S,S,S,S,S,S,S,S,S,S,S,S,S,S,S,S,S,S,S,S,S,S,90,6,0,0,S,0,S,1,0,S,1,2,2,2,2,1,1,1,1,1,4,4,1,1,4,1,1,1,1,1,5,S,S,15,12,24,12,0,S,S,S,4,0,30,2,2,3,1,3,1,3,3,10520