CID,MAT_COUN,responded,surveylanguage,survey,newprotocol,daysfromtxstart30,daysfromtxstart60,daysfromtxstart90,daysfromtxstart91plus,monthsenrolled,inanytx,currentbup,currentcoun,currentmmt,currentntx,difftx,endindextx,daysinxtx,txepisodes,adverse,tookmeds,indcoun,grpcoun,peernav,selfhelp90,coun90,ncoun90,abstinent30ohf,abstinent90ohfmb,opuse30,opuse30users,opabst90,fnuse30,fnuse30users,fnabst90,hruse30,hruse30users,hrabst90,mmbpabst90,diversionuse90,diversiongive,suoverdose,opoverdose,edvisit,opedvisit,hospstay,ophospstay,pcp90,HepCtest12m,hepcpositive,HIVtest12m,mentalillness,insurance,healthins,nohealthins,employed,socialsupportscore,socialsupportcat,lowsocialsupport,modsocialsupport,highsocialsupport,ace,hrqol,indexstatus,SS2,SS4,SS5_1,SS5_3,SS5_4,SS5_5,SS5_6,SS5_7,SS5_8,SS5_9,SS5_10,SS5_12,SS5_13,SS11_1,SS11_2,SS11_3,SS11_4,SS11_5,SS11_6,SS11_7,SS12_1,SS12_2,SS12_3,SS12_4,SS12_5,SS12_6,SS12_7,SS12_8,SS12_9,SS12_10,SS12_11,SS12_12,SS12_13,SS12_14,SS12_15,PN1,PN2,PN3,PN4_1,PN4_2,PN4_3,PN4_4,PN4_5,PN4_6,PN4_7,PN4_8,PN4_9,PN5_A,PN5_B,PN5_C,PN5_D,PN5_E,OU2,OU3,OU4,PX1,PX3A_R1,PX3B_R1,PX3C_R1,PX3D_R1,PX3E_R1,PX3F_R1,PX3G_R1,PX3I_R1,PX3J_R1,PX3K_R1,PX3L_R1,PX3M_R1,PX3N_R1,PX3O_R1,PX3P_R1,PX4_1_R1,PX4_2_R1,PX4_3_R1,PX4_11_R1,PX5_1_R1,PX5_2_R1,PX5_3_R1,PX5_4_R1,PX5_5_R1,PX5_6_R1,PX5_7_R1,PX5_8_R1,PX5_9_R1,PX10_R1,PX11_R1,PX13_R1,PX13_R2,PX13_R3,PX13_R4,PX13_R5,PX13_R6,PX13_R7,PX13_R8,PX13_R9,PX13_R10,PX13_R11,PX13_R12,QA1,QA2,QA3,MM1,MM4,MM6,MM6a,MM7,MM7X1,MM7X2,MM10,MM11,MM12,MM13,MM14_1,MM14_2,MM14_3,MM14_4,MM14_5,MM15,MM16_1,MM16_2,MM16_3,MM16_4,MM16_5,MM16_6,MM16_7,BU1,BU4,BU6,BU6a,BU7,BU10,BU11,BU11A,BU11B,BU12,BU13,BU14_1,BU14_2,BU14_3,BU14_4,BU14_5,BU15,BU16_1,BU16_2,BU16_3,BU16_4,BU16_5,BU16_6,BU16_7,PB1,PB1A,PB4,PB6,PB6a,PB7,PB10,PB11,ON1,ON4,ON6,ON6a,ON7,ON10,ON11,ON12,ON13,ON14,ON15_1,ON15_2,ON15_3,ON15_4,ON15_5,ON15_6,ON15_7,ON16,IN1,IN4,IN6,IN6a,IN7,IN10,IN11_1,IN11_2,IN11_3,IN11_4,IN11_5,IN11_6,IN11_7,IN12,HST1_A1,HST1_A2,HST1_A3,HST1_A4,HST1_A5,HST1_A6,HST1_A7,KA1A,KA1B,KA1C,KA1D,KA1E,KA1F,KA1G,KA1H,KA1I,KA1J,KA1K,KA1L,SA1,SA2,SA3,SA7,SA8,SA9,SA10,AC1_1,AC1_2,AC1_3,AC1_4,AC1_5,AC1_6,AC1_7,AC1_8,AC1_9,AC1_10,AC1_11,AC1_12,AC2_1_R1,AC2_2_R1,AC2_3_R1,AC2_4_R1,AC2_1_R2,AC2_2_R2,AC2_3_R2,AC2_4_R2,AC2_1_R6,AC2_2_R6,AC2_3_R6,AC2_4_R6,AC2_1_R7,AC2_2_R7,AC2_3_R7,AC2_4_R7,AC2_1_R8,AC2_2_R8,AC2_3_R8,AC2_4_R8,AC2_1_R9,AC2_2_R9,AC2_3_R9,AC2_4_R9,AC2_1_R10,AC2_2_R10,AC2_3_R10,AC2_4_R10,AC2_1_R11,AC2_2_R11,AC2_3_R11,AC2_4_R11,AC3_R1,AC3_R2,AC3_R6,AC3_R7,AC3_R8,AC3_R9,AC3_R10,AC3_R11,AC4_R1,AC4_R2,AC4_R6,AC4_R7,AC4_R8,AC4_R9,AC4_R10,AC4_R11,DW4,DW5,HS3,HS3A,HS4,HS4A,ED3,ED3A,ED4,ED4A,SH1,SH4,SH5,PC3,PC3A,PC4,PC4A,LM1,LM1A,LM2,LM2_Y,LM2_M,LM2_W,LM3,LM3_UNIT,LM4,LM5,LM6,LM7,LM8_1,LM8_2,LM8_3,LM8_4,LM8_5,LM8_6,LM8_7,LM8_8,SU10_1,SU10_2,SU10_3,SU10_4,SU10_5,SU10_6,SU10_7,SU10_8,SU10_9,SU10_10,SU10_11,SU10_12,SU10_13,SU10_14,SU10_15,SU10_16,SU50_R1,SU50_R2,SU50_R3,SU50_R4,SU50_R5,SU50_R6,SU50_R7,SU50_R8,SU50_R9,SU50_R10,SU50_R12,SU51_1_R1,SU51_2_R1,SU51_3_R1,SU51_4_R1,SU51_5_R1,SU51_6_R1,SU51_7_R1,SU51_1_R2,SU51_2_R2,SU51_3_R2,SU51_4_R2,SU51_5_R2,SU51_6_R2,SU51_7_R2,SU51_1_R3,SU51_2_R3,SU51_3_R3,SU51_4_R3,SU51_5_R3,SU51_6_R3,SU51_7_R3,SU51_1_R4,SU51_2_R4,SU51_3_R4,SU51_4_R4,SU51_5_R4,SU51_6_R4,SU51_7_R4,SU51_1_R5,SU51_2_R5,SU51_3_R5,SU51_4_R5,SU51_5_R5,SU51_6_R5,SU51_7_R5,SU51_1_R6,SU51_2_R6,SU51_3_R6,SU51_4_R6,SU51_5_R6,SU51_6_R6,SU51_7_R6,SU51_1_R7,SU51_2_R7,SU51_3_R7,SU51_4_R7,SU51_5_R7,SU51_6_R7,SU51_7_R7,SU51_1_R8,SU51_2_R8,SU51_3_R8,SU51_4_R8,SU51_5_R8,SU51_6_R8,SU51_7_R8,SU51_1_R9,SU51_2_R9,SU51_3_R9,SU51_4_R9,SU51_5_R9,SU51_6_R9,SU51_7_R9,SU51_1_R10,SU51_2_R10,SU51_3_R10,SU51_4_R10,SU51_5_R10,SU51_6_R10,SU51_7_R10,SU60_R1,SU60_R2,SU60_R3,SU60_R4,SU60_R5,SU60_R6,SU60_R7,SU60_R8,SU60_R9,SU60_R10,SU61_1_R1,SU61_2_R1,SU61_3_R1,SU61_4_R1,SU61_5_R1,SU61_6_R1,SU61_7_R1,SU61_1_R2,SU61_2_R2,SU61_3_R2,SU61_4_R2,SU61_5_R2,SU61_6_R2,SU61_7_R2,SU61_1_R3,SU61_2_R3,SU61_3_R3,SU61_4_R3,SU61_5_R3,SU61_6_R3,SU61_7_R3,SU61_1_R4,SU61_2_R4,SU61_3_R4,SU61_4_R4,SU61_5_R4,SU61_6_R4,SU61_7_R4,SU61_1_R5,SU61_2_R5,SU61_3_R5,SU61_4_R5,SU61_5_R5,SU61_6_R5,SU61_7_R5,SU61_1_R6,SU61_2_R6,SU61_3_R6,SU61_4_R6,SU61_5_R6,SU61_6_R6,SU61_7_R6,SU61_1_R7,SU61_2_R7,SU61_3_R7,SU61_4_R7,SU61_5_R7,SU61_6_R7,SU61_7_R7,SU61_1_R8,SU61_2_R8,SU61_3_R8,SU61_4_R8,SU61_5_R8,SU61_6_R8,SU61_7_R8,SU61_1_R9,SU61_2_R9,SU61_3_R9,SU61_4_R9,SU61_5_R9,SU61_6_R9,SU61_7_R9,SU61_1_R10,SU61_2_R10,SU61_3_R10,SU61_4_R10,SU61_5_R10,SU61_6_R10,SU61_7_R10,SU70_R1,SU70_R2,SU70_R3,SU70_R4,SU70_R5,SU70_R6,SU70_R7,SU70_R8,SU70_R9,SU70_R10,SU71_1_R1,SU71_2_R1,SU71_3_R1,SU71_4_R1,SU71_5_R1,SU71_6_R1,SU71_7_R1,SU71_1_R2,SU71_2_R2,SU71_3_R2,SU71_4_R2,SU71_5_R2,SU71_6_R2,SU71_7_R2,SU71_1_R3,SU71_2_R3,SU71_3_R3,SU71_4_R3,SU71_5_R3,SU71_6_R3,SU71_7_R3,SU71_1_R4,SU71_2_R4,SU71_3_R4,SU71_4_R4,SU71_5_R4,SU71_6_R4,SU71_7_R4,SU71_1_R5,SU71_2_R5,SU71_3_R5,SU71_4_R5,SU71_5_R5,SU71_6_R5,SU71_7_R5,SU71_1_R6,SU71_2_R6,SU71_3_R6,SU71_4_R6,SU71_5_R6,SU71_6_R6,SU71_7_R6,SU71_1_R7,SU71_2_R7,SU71_3_R7,SU71_4_R7,SU71_5_R7,SU71_6_R7,SU71_7_R7,SU71_1_R8,SU71_2_R8,SU71_3_R8,SU71_4_R8,SU71_5_R8,SU71_6_R8,SU71_7_R8,SU71_1_R9,SU71_2_R9,SU71_3_R9,SU71_4_R9,SU71_5_R9,SU71_6_R9,SU71_7_R9,SU71_1_R10,SU71_2_R10,SU71_3_R10,SU71_4_R10,SU71_5_R10,SU71_6_R10,SU71_7_R10,PO3,PO4,PO5,PO6,PO7A_1,PO7A_2,PO7A_3,PO7A_4,PO7A_5,PO7A_6,PO7A_7,PO7A_8,PO7A_9,PO7B_1,PO7B_2,PO7B_3,PO7B_4,PO7B_5,PO7B_6,PO7B_7,PO7B_8,PO7B_9,PO7C,PO8A_1,PO8A_2,PO8A_3,PO8A_4,PO8A_5,PO8A_6,PO8A_7,PO8A_8,PO8A_9,PO8A_10,PO8A_11,PO8A_12,PO8A_13,PO8A_14,PO8B_1,PO8B_2,PO8B_3,PO8B_4,PO8B_5,PO8B_6,PO8B_7,PO8B_8,PO8B_9,PO8B_10,PO8B_11,PO8B_12,PO8B_13,PO8B_14,PO8C,PO9,PO9_MG,PO9_OUA,FE2,FE3,FE4,FE5,FE6,HU2,HU3,HU4,HU5,HU6,HU7,HU7_GMS,HU8,DO1,DO6,DO7,DO8,DO9,DO10_1,DO10_2,DO10_3,DO10_4,DO10_5,DO11,DO12,DO13,DO14,DO15_1,DO15_2,DO15_3,DO15_4,DO15_5,DO15_6,DO15_7,DO15_8,DO15_9,DO15_10,DO15_11,DO15_12,DO15_13,DO15_14,DO15_15,PD1A,PD2_1,PD2_2,PD2_3,PD2_4,PD2_5,PD2_6,PD2_7,PD2_8,PD2_9,PD2_10,PD2_11,PD2_12,PD2_13,PD2_14,PD2_15,PD2_16,PD2_17,PD2_18,PD2_20,PD2_21,HV1,HV3,HC1,HC3,HC4,EQ1,EQ2,EQ3,EQ4,EQ5,EQ6,BF1,BF2,BF3,BF4,BF5,BF6,BF7_DAYS,BF7_WKS,BF7_MONTHS,BF7_YEARS,BF8,BF9,BF10,BF11,BF12,BF13,BF14,MD1_1,MD1_2,MD1_3,MD1_4,MD1_5,MD1_6,MD1_7,MD1_8,MD1_9,MD1_10,MD1_11,MD1_12,MD1_13,MD1_14,MD1_15,MD2,MD3,PS1A,PS1B,PS1C,PS1D,PS1E,PS1F,PS1G,PS1H,PS1I,PS1J,PQ1A,PQ1B,PQ1C,PQ1D,PQ1E,PQ1F,PQ1G,PQ1H,PT1A,PT1B,PT1C,PT1D,SO1A,SO1B,SO1C,SO1D,SO1E,SO1F,SO1G,SO1H,SO1I,SO1J,SO1K,SO1L,HI1_1,HI1_2,HI1_3,HI1_4,HI1_5,HI1_6,HI1_7,HI1_8,HI2,HI3,D11_1,D11_2,D11_3,D11_4,D11_5,D11_6,D11_7,D11_8,D11_9,pufsite_ID
AAD78283BX,2,0,Z,5,Z,Z,Z,Z,Z,Z,Z,Z,Z,Z,Z,Z,Z,Z,Z,Z,Z,Z,Z,Z,Z,Z,Z,Z,Z,Z,Z,Z,Z,Z,Z,Z,Z,Z,Z,Z,Z,Z,Z,Z,Z,Z,Z,Z,Z,Z,Z,,Z,Z,Z,Z,,,,,,Z,Z,Z,Z,Z,Z,Z,Z,Z,Z,Z,Z,Z,Z,Z,Z,Z,Z,Z,Z,Z,Z,Z,Z,Z,Z,Z,Z,Z,Z,Z,Z,Z,Z,Z,Z,Z,Z,Z,Z,Z,Z,Z,Z,Z,Z,Z,Z,Z,Z,Z,Z,Z,Z,Z,Z,Z,Z,Z,Z,Z,Z,Z,Z,Z,Z,Z,Z,Z,Z,Z,Z,Z,Z,Z,Z,Z,Z,Z,Z,Z,Z,Z,Z,Z,Z,Z,Z,Z,Z,Z,Z,Z,Z,Z,Z,Z,Z,Z,Z,Z,Z,Z,Z,Z,Z,Z,Z,Z,Z,Z,Z,Z,Z,Z,Z,Z,Z,Z,Z,Z,Z,Z,Z,Z,Z,Z,Z,Z,Z,Z,Z,Z,Z,Z,Z,Z,Z,Z,Z,Z,Z,Z,Z,Z,Z,Z,Z,Z,Z,Z,Z,Z,Z,Z,Z,Z,Z,Z,Z,Z,Z,Z,Z,Z,Z,Z,Z,Z,Z,Z,Z,Z,Z,Z,Z,Z,Z,Z,Z,Z,Z,Z,Z,Z,Z,Z,Z,Z,Z,Z,Z,Z,Z,Z,Z,Z,Z,Z,Z,Z,Z,Z,Z,Z,Z,Z,Z,Z,Z,Z,Z,Z,Z,Z,Z,Z,Z,Z,Z,Z,Z,Z,Z,Z,Z,Z,Z,Z,Z,Z,Z,Z,Z,Z,Z,Z,Z,Z,Z,Z,Z,Z,Z,Z,Z,Z,Z,Z,Z,Z,Z,Z,Z,Z,Z,Z,Z,Z,Z,Z,Z,Z,Z,Z,Z,Z,Z,Z,Z,Z,Z,Z,Z,Z,Z,Z,Z,Z,Z,Z,Z,Z,Z,Z,Z,Z,Z,Z,Z,Z,Z,Z,Z,Z,Z,Z,Z,Z,Z,Z,Z,Z,Z,Z,Z,Z,Z,Z,Z,Z,Z,Z,Z,Z,Z,Z,Z,Z,Z,Z,Z,Z,Z,Z,Z,Z,Z,Z,Z,Z,Z,Z,Z,Z,Z,Z,Z,Z,Z,Z,Z,Z,Z,Z,Z,Z,Z,Z,Z,Z,Z,Z,Z,Z,Z,Z,Z,Z,Z,Z,Z,Z,Z,Z,Z,Z,Z,Z,Z,Z,Z,Z,Z,Z,Z,Z,Z,Z,Z,Z,Z,Z,Z,Z,Z,Z,Z,Z,Z,Z,Z,Z,Z,Z,Z,Z,Z,Z,Z,Z,Z,Z,Z,Z,Z,Z,Z,Z,Z,Z,Z,Z,Z,Z,Z,Z,Z,Z,Z,Z,Z,Z,Z,Z,Z,Z,Z,Z,Z,Z,Z,Z,Z,Z,Z,Z,Z,Z,Z,Z,Z,Z,Z,Z,Z,Z,Z,Z,Z,Z,Z,Z,Z,Z,Z,Z,Z,Z,Z,Z,Z,Z,Z,Z,Z,Z,Z,Z,Z,Z,Z,Z,Z,Z,Z,Z,Z,Z,Z,Z,Z,Z,Z,Z,Z,Z,Z,Z,Z,Z,Z,Z,Z,Z,Z,Z,Z,Z,Z,Z,Z,Z,Z,Z,Z,Z,Z,Z,Z,Z,Z,Z,Z,Z,Z,Z,Z,Z,Z,Z,Z,Z,Z,Z,Z,Z,Z,Z,Z,Z,Z,Z,Z,Z,Z,Z,Z,Z,Z,Z,Z,Z,Z,Z,Z,Z,Z,Z,Z,Z,Z,Z,Z,Z,Z,Z,Z,Z,Z,Z,Z,Z,Z,Z,Z,Z,Z,Z,Z,Z,Z,Z,Z,Z,Z,Z,Z,Z,Z,Z,Z,Z,Z,Z,Z,Z,Z,Z,Z,Z,Z,Z,Z,Z,Z,Z,Z,Z,Z,Z,Z,Z,Z,Z,Z,Z,Z,Z,Z,Z,Z,Z,Z,Z,Z,Z,Z,Z,Z,Z,Z,Z,Z,Z,Z,Z,Z,Z,Z,Z,Z,Z,Z,Z,Z,Z,Z,Z,Z,Z,Z,Z,Z,Z,Z,Z,Z,Z,Z,Z,Z,Z,Z,Z,Z,Z,Z,Z,Z,Z,Z,Z,Z,Z,Z,Z,Z,Z,Z,Z,Z,Z,Z,Z,Z,Z,Z,Z,Z,Z,Z,Z,Z,Z,Z,Z,Z,Z,Z,Z,Z,Z,Z,Z,Z,Z,Z,Z,Z,Z,Z,Z,Z,Z,Z,Z,Z,Z,Z,Z,Z,Z,Z,Z,Z,Z,Z,Z,Z,Z,Z,Z,Z,Z,Z,Z,Z,Z,Z,Z,Z,Z,Z,Z,Z,Z,Z,Z,Z,Z,Z,Z,Z,Z,Z,Z,Z,Z,Z,Z,Z,Z,Z,Z,Z,Z,Z,Z,Z,Z,Z,Z,Z,Z,Z,Z,Z,Z,Z,Z,Z,Z,Z,Z,Z,Z,Z,Z,Z,Z,Z,Z,Z,Z,Z,Z,Z,10250
AAN33708XC,1,0,Z,5,Z,Z,Z,Z,Z,Z,Z,Z,Z,Z,Z,Z,Z,Z,Z,Z,Z,Z,Z,Z,Z,Z,Z,Z,Z,Z,Z,Z,Z,Z,Z,Z,Z,Z,Z,Z,Z,Z,Z,Z,Z,Z,Z,Z,Z,Z,Z,,Z,Z,Z,Z,,,,,,Z,Z,Z,Z,Z,Z,Z,Z,Z,Z,Z,Z,Z,Z,Z,Z,Z,Z,Z,Z,Z,Z,Z,Z,Z,Z,Z,Z,Z,Z,Z,Z,Z,Z,Z,Z,Z,Z,Z,Z,Z,Z,Z,Z,Z,Z,Z,Z,Z,Z,Z,Z,Z,Z,Z,Z,Z,Z,Z,Z,Z,Z,Z,Z,Z,Z,Z,Z,Z,Z,Z,Z,Z,Z,Z,Z,Z,Z,Z,Z,Z,Z,Z,Z,Z,Z,Z,Z,Z,Z,Z,Z,Z,Z,Z,Z,Z,Z,Z,Z,Z,Z,Z,Z,Z,Z,Z,Z,Z,Z,Z,Z,Z,Z,Z,Z,Z,Z,Z,Z,Z,Z,Z,Z,Z,Z,Z,Z,Z,Z,Z,Z,Z,Z,Z,Z,Z,Z,Z,Z,Z,Z,Z,Z,Z,Z,Z,Z,Z,Z,Z,Z,Z,Z,Z,Z,Z,Z,Z,Z,Z,Z,Z,Z,Z,Z,Z,Z,Z,Z,Z,Z,Z,Z,Z,Z,Z,Z,Z,Z,Z,Z,Z,Z,Z,Z,Z,Z,Z,Z,Z,Z,Z,Z,Z,Z,Z,Z,Z,Z,Z,Z,Z,Z,Z,Z,Z,Z,Z,Z,Z,Z,Z,Z,Z,Z,Z,Z,Z,Z,Z,Z,Z,Z,Z,Z,Z,Z,Z,Z,Z,Z,Z,Z,Z,Z,Z,Z,Z,Z,Z,Z,Z,Z,Z,Z,Z,Z,Z,Z,Z,Z,Z,Z,Z,Z,Z,Z,Z,Z,Z,Z,Z,Z,Z,Z,Z,Z,Z,Z,Z,Z,Z,Z,Z,Z,Z,Z,Z,Z,Z,Z,Z,Z,Z,Z,Z,Z,Z,Z,Z,Z,Z,Z,Z,Z,Z,Z,Z,Z,Z,Z,Z,Z,Z,Z,Z,Z,Z,Z,Z,Z,Z,Z,Z,Z,Z,Z,Z,Z,Z,Z,Z,Z,Z,Z,Z,Z,Z,Z,Z,Z,Z,Z,Z,Z,Z,Z,Z,Z,Z,Z,Z,Z,Z,Z,Z,Z,Z,Z,Z,Z,Z,Z,Z,Z,Z,Z,Z,Z,Z,Z,Z,Z,Z,Z,Z,Z,Z,Z,Z,Z,Z,Z,Z,Z,Z,Z,Z,Z,Z,Z,Z,Z,Z,Z,Z,Z,Z,Z,Z,Z,Z,Z,Z,Z,Z,Z,Z,Z,Z,Z,Z,Z,Z,Z,Z,Z,Z,Z,Z,Z,Z,Z,Z,Z,Z,Z,Z,Z,Z,Z,Z,Z,Z,Z,Z,Z,Z,Z,Z,Z,Z,Z,Z,Z,Z,Z,Z,Z,Z,Z,Z,Z,Z,Z,Z,Z,Z,Z,Z,Z,Z,Z,Z,Z,Z,Z,Z,Z,Z,Z,Z,Z,Z,Z,Z,Z,Z,Z,Z,Z,Z,Z,Z,Z,Z,Z,Z,Z,Z,Z,Z,Z,Z,Z,Z,Z,Z,Z,Z,Z,Z,Z,Z,Z,Z,Z,Z,Z,Z,Z,Z,Z,Z,Z,Z,Z,Z,Z,Z,Z,Z,Z,Z,Z,Z,Z,Z,Z,Z,Z,Z,Z,Z,Z,Z,Z,Z,Z,Z,Z,Z,Z,Z,Z,Z,Z,Z,Z,Z,Z,Z,Z,Z,Z,Z,Z,Z,Z,Z,Z,Z,Z,Z,Z,Z,Z,Z,Z,Z,Z,Z,Z,Z,Z,Z,Z,Z,Z,Z,Z,Z,Z,Z,Z,Z,Z,Z,Z,Z,Z,Z,Z,Z,Z,Z,Z,Z,Z,Z,Z,Z,Z,Z,Z,Z,Z,Z,Z,Z,Z,Z,Z,Z,Z,Z,Z,Z,Z,Z,Z,Z,Z,Z,Z,Z,Z,Z,Z,Z,Z,Z,Z,Z,Z,Z,Z,Z,Z,Z,Z,Z,Z,Z,Z,Z,Z,Z,Z,Z,Z,Z,Z,Z,Z,Z,Z,Z,Z,Z,Z,Z,Z,Z,Z,Z,Z,Z,Z,Z,Z,Z,Z,Z,Z,Z,Z,Z,Z,Z,Z,Z,Z,Z,Z,Z,Z,Z,Z,Z,Z,Z,Z,Z,Z,Z,Z,Z,Z,Z,Z,Z,Z,Z,Z,Z,Z,Z,Z,Z,Z,Z,Z,Z,Z,Z,Z,Z,Z,Z,Z,Z,Z,Z,Z,Z,Z,Z,Z,Z,Z,Z,Z,Z,Z,Z,Z,Z,Z,Z,Z,Z,Z,Z,Z,Z,Z,Z,Z,Z,Z,Z,Z,Z,Z,Z,Z,Z,Z,Z,Z,Z,Z,Z,Z,Z,Z,Z,Z,Z,Z,Z,Z,Z,Z,Z,Z,Z,Z,Z,Z,Z,Z,Z,Z,Z,Z,Z,Z,Z,Z,Z,Z,Z,Z,Z,Z,10090
AAR15284NQ,1,1,1,5,0,0,1,0,0,16,1,0,0,1,0,0,0,530,0,0,1,1,1,1,0,1,4,1,1,0,U,1,0,U,1,0,U,1,1,1,1,0,0,0,0,0,0,1,0,U,0,0,1,1,0,1,7,1,0,1,1,1,1,1,1,S,S,S,S,S,S,S,S,S,S,S,S,1,0,0,0,0,0,0,1,1,0,0,1,0,0,1,0,0,0,0,0,0,0,1,2,1,S,S,S,S,S,S,S,S,S,1,3,3,3,1,2,S,1,S,S,S,S,S,S,S,S,S,S,S,S,S,S,S,S,S,S,S,S,S,S,S,S,S,S,S,S,S,S,S,S,S,S,S,S,S,S,S,S,S,S,S,0,S,S,N,1,N,N,1,N,N,1,205,1,1,S,S,S,S,S,S,S,S,S,S,S,S,S,2,S,S,S,S,S,S,S,S,S,S,S,S,S,S,S,S,S,S,S,S,S,S,S,2,S,S,S,S,S,S,S,2,S,S,S,S,S,S,S,S,S,S,S,S,S,S,S,S,S,2,S,S,S,S,S,S,S,S,S,S,S,S,S,S,S,S,S,S,S,S,4,4,3,4,4,4,3,4,4,4,3,4,6,4,2,15,0,8,4,0,0,0,0,0,0,0,0,0,0,0,1,S,S,S,S,S,S,S,S,S,S,S,S,S,S,S,S,S,S,S,S,S,S,S,S,S,S,S,S,S,S,S,S,S,S,S,S,S,S,S,S,S,S,S,S,S,S,S,S,0,S,0,S,S,S,0,S,S,S,1,1,1,1,0,2,0,1,S,1,S,S,2,14,1,2,40,0,S,1,0,0,0,0,0,0,0,0,0,0,0,0,0,0,0,0,0,0,0,0,0,0,1,S,S,S,S,S,S,S,S,S,S,S,S,S,S,S,S,S,S,S,S,S,S,S,S,S,S,S,S,S,S,S,S,S,S,S,S,S,S,S,S,S,S,S,S,S,S,S,S,S,S,S,S,S,S,S,S,S,S,S,S,S,S,S,S,S,S,S,S,S,S,S,S,S,S,S,S,S,S,S,S,S,S,S,S,S,S,S,S,S,S,S,S,S,S,S,S,S,S,S,S,S,S,S,S,S,S,S,S,S,S,S,S,S,S,S,S,S,S,S,S,S,S,S,S,S,S,S,S,S,S,S,S,S,S,S,S,S,S,S,S,S,S,S,S,S,S,S,S,S,S,S,S,S,S,S,S,S,S,S,S,S,S,S,S,S,S,S,S,S,S,S,S,S,S,S,S,S,S,S,S,S,S,S,S,S,S,S,S,S,S,S,S,S,S,S,S,S,S,S,S,S,S,S,S,S,S,S,S,S,S,S,S,S,S,S,S,S,S,S,S,S,S,S,S,S,S,S,S,S,S,S,S,S,S,S,S,S,S,S,S,S,S,S,S,S,S,S,S,S,S,S,S,S,S,S,S,S,S,S,S,S,S,S,S,S,S,S,S,S,S,S,S,S,S,S,S,S,S,S,S,S,S,S,S,S,S,S,S,S,S,S,S,S,S,S,S,S,S,S,S,S,S,S,S,S,S,S,S,S,2,S,S,S,S,S,S,S,S,S,S,S,S,S,S,S,S,S,S,S,S,S,S,S,S,S,S,S,S,2,0,1,0,0,0,0,0,0,0,0,0,0,0,0,0,0,0,0,0,0,1,2,1,2,S,1,1,1,1,1,95,3,0,0,0,2,S,S,S,S,S,2,2,0,0,0,0,0,0,0,0,0,0,0,0,0,0,0,0,0,0,0,1,2,2,1,1,1,5,1,1,5,5,1,1,1,1,1,1,1,1,1,1,2,2,2,2,1,1,1,1,1,1,1,1,1,1,1,1,0,0,0,0,1,0,0,0,S,S,1,0,0,0,0,0,0,0,0,10090
ABA29348BB,1,1,1,5,1,0,0,0,1,16.93333333,1,0,0,1,0,0,0,2104,0,0,1,1,0,0,0,1,6,1,0,0,U,1,0,U,1,0,U,1,0,5,1,0,0,0,0,0,0,0,0,U,0,0,1,1,0,0,6.416666667,1,0,1,1,1,0.82,1,1,S,S,S,S,S,S,S,S,S,S,S,S,1,0,0,0,0,0,0,1,0,0,0,1,0,0,1,1,0,0,1,0,0,0,1,6,S,1,0,0,0,0,0,0,0,0,1,3,3,2,1,2,S,1,S,S,S,S,S,S,S,S,S,S,S,S,S,S,S,S,S,S,S,S,S,S,S,S,S,S,S,S,S,S,S,S,S,S,S,S,S,S,S,S,S,S,S,0,S,S,N,1,N,N,1,2,S,1,70,1,1,S,S,S,S,S,S,S,S,S,S,S,S,S,2,S,S,S,S,S,S,S,S,S,S,S,S,S,S,S,S,S,S,S,S,S,S,S,2,S,S,S,S,S,S,S,2,S,S,S,S,S,S,S,S,S,S,S,S,S,S,S,S,S,2,S,S,S,S,S,S,S,S,S,S,S,S,S,S,S,S,S,S,S,S,3,3,2,2,2,2,2,2,2,2,2,2,6,2,2,70,0,6,6,0,0,0,0,0,0,0,0,0,0,0,1,S,S,S,S,S,S,S,S,S,S,S,S,S,S,S,S,S,S,S,S,S,S,S,S,S,S,S,S,S,S,S,S,S,S,S,S,S,S,S,S,S,S,S,S,S,S,S,S,0,S,0,S,S,S,0,S,S,S,2,S,S,0,S,1,0,2,1,2,S,3,S,12.75,1,12,24,0,S,1,0,0,0,0,0,0,0,0,1,0,0,0,0,0,1,0,0,0,0,0,0,1,0,S,4,S,S,S,S,S,3,S,S,S,S,S,S,S,S,S,S,0,0,0,0,0,0,1,S,S,S,S,S,S,S,S,S,S,S,S,S,S,S,S,S,S,S,S,S,S,S,S,S,S,S,S,S,S,S,S,S,S,S,0,0,0,1,0,0,0,S,S,S,S,S,S,S,S,S,S,S,S,S,S,S,5,S,S,S,S,S,4,S,S,S,S,S,S,S,S,S,0,0,0,0,0,0,1,S,S,S,S,S,S,S,S,S,S,S,S,S,S,S,S,S,S,S,S,S,S,S,S,S,S,S,S,S,S,S,S,S,S,S,0,0,0,1,0,0,0,S,S,S,S,S,S,S,S,S,S,S,S,S,S,S,30,S,S,S,S,S,10,S,S,S,S,S,S,S,S,S,0,0,0,0,0,0,1,S,S,S,S,S,S,S,S,S,S,S,S,S,S,S,S,S,S,S,S,S,S,S,S,S,S,S,S,S,S,S,S,S,S,S,0,0,0,1,0,0,0,S,S,S,S,S,S,S,S,S,S,S,S,S,S,S,S,S,S,S,S,S,S,S,S,S,S,S,S,S,S,S,S,S,S,S,S,S,S,S,S,S,S,S,S,S,S,S,S,S,S,S,S,S,S,S,S,S,S,S,S,S,S,S,S,S,S,S,S,S,S,S,S,S,S,S,S,S,S,S,S,S,S,2,S,S,S,S,S,S,S,S,S,S,S,S,S,S,S,S,S,S,S,S,S,S,S,S,S,S,S,S,2,1,0,0,0,0,0,0,0,0,0,1,0,0,0,0,0,0,0,0,0,1,2,1,2,S,1,1,1,2,2,50,4,10,20,20,2,S,S,S,S,S,2,2,0,20,15,30,3,0,0,0,0,0,0,0,0,0,0,0,0,0,0,1,2,2,4,5,5,3,3,3,3,3,3,5,3,3,2,3,3,2,1,1,2,1,1,1,1,1,1,1,1,2,4,1,1,1,1,4,0,0,0,0,0,0,1,0,S,S,1,0,1,0,0,0,0,0,0,10120
ABG89352WF,1,0,Z,5,Z,Z,Z,Z,Z,Z,Z,Z,Z,Z,Z,Z,Z,Z,Z,Z,Z,Z,Z,Z,Z,Z,Z,Z,Z,Z,Z,Z,Z,Z,Z,Z,Z,Z,Z,Z,Z,Z,Z,Z,Z,Z,Z,Z,Z,Z,Z,,Z,Z,Z,Z,,,,,,Z,Z,Z,Z,Z,Z,Z,Z,Z,Z,Z,Z,Z,Z,Z,Z,Z,Z,Z,Z,Z,Z,Z,Z,Z,Z,Z,Z,Z,Z,Z,Z,Z,Z,Z,Z,Z,Z,Z,Z,Z,Z,Z,Z,Z,Z,Z,Z,Z,Z,Z,Z,Z,Z,Z,Z,Z,Z,Z,Z,Z,Z,Z,Z,Z,Z,Z,Z,Z,Z,Z,Z,Z,Z,Z,Z,Z,Z,Z,Z,Z,Z,Z,Z,Z,Z,Z,Z,Z,Z,Z,Z,Z,Z,Z,Z,Z,Z,Z,Z,Z,Z,Z,Z,Z,Z,Z,Z,Z,Z,Z,Z,Z,Z,Z,Z,Z,Z,Z,Z,Z,Z,Z,Z,Z,Z,Z,Z,Z,Z,Z,Z,Z,Z,Z,Z,Z,Z,Z,Z,Z,Z,Z,Z,Z,Z,Z,Z,Z,Z,Z,Z,Z,Z,Z,Z,Z,Z,Z,Z,Z,Z,Z,Z,Z,Z,Z,Z,Z,Z,Z,Z,Z,Z,Z,Z,Z,Z,Z,Z,Z,Z,Z,Z,Z,Z,Z,Z,Z,Z,Z,Z,Z,Z,Z,Z,Z,Z,Z,Z,Z,Z,Z,Z,Z,Z,Z,Z,Z,Z,Z,Z,Z,Z,Z,Z,Z,Z,Z,Z,Z,Z,Z,Z,Z,Z,Z,Z,Z,Z,Z,Z,Z,Z,Z,Z,Z,Z,Z,Z,Z,Z,Z,Z,Z,Z,Z,Z,Z,Z,Z,Z,Z,Z,Z,Z,Z,Z,Z,Z,Z,Z,Z,Z,Z,Z,Z,Z,Z,Z,Z,Z,Z,Z,Z,Z,Z,Z,Z,Z,Z,Z,Z,Z,Z,Z,Z,Z,Z,Z,Z,Z,Z,Z,Z,Z,Z,Z,Z,Z,Z,Z,Z,Z,Z,Z,Z,Z,Z,Z,Z,Z,Z,Z,Z,Z,Z,Z,Z,Z,Z,Z,Z,Z,Z,Z,Z,Z,Z,Z,Z,Z,Z,Z,Z,Z,Z,Z,Z,Z,Z,Z,Z,Z,Z,Z,Z,Z,Z,Z,Z,Z,Z,Z,Z,Z,Z,Z,Z,Z,Z,Z,Z,Z,Z,Z,Z,Z,Z,Z,Z,Z,Z,Z,Z,Z,Z,Z,Z,Z,Z,Z,Z,Z,Z,Z,Z,Z,Z,Z,Z,Z,Z,Z,Z,Z,Z,Z,Z,Z,Z,Z,Z,Z,Z,Z,Z,Z,Z,Z,Z,Z,Z,Z,Z,Z,Z,Z,Z,Z,Z,Z,Z,Z,Z,Z,Z,Z,Z,Z,Z,Z,Z,Z,Z,Z,Z,Z,Z,Z,Z,Z,Z,Z,Z,Z,Z,Z,Z,Z,Z,Z,Z,Z,Z,Z,Z,Z,Z,Z,Z,Z,Z,Z,Z,Z,Z,Z,Z,Z,Z,Z,Z,Z,Z,Z,Z,Z,Z,Z,Z,Z,Z,Z,Z,Z,Z,Z,Z,Z,Z,Z,Z,Z,Z,Z,Z,Z,Z,Z,Z,Z,Z,Z,Z,Z,Z,Z,Z,Z,Z,Z,Z,Z,Z,Z,Z,Z,Z,Z,Z,Z,Z,Z,Z,Z,Z,Z,Z,Z,Z,Z,Z,Z,Z,Z,Z,Z,Z,Z,Z,Z,Z,Z,Z,Z,Z,Z,Z,Z,Z,Z,Z,Z,Z,Z,Z,Z,Z,Z,Z,Z,Z,Z,Z,Z,Z,Z,Z,Z,Z,Z,Z,Z,Z,Z,Z,Z,Z,Z,Z,Z,Z,Z,Z,Z,Z,Z,Z,Z,Z,Z,Z,Z,Z,Z,Z,Z,Z,Z,Z,Z,Z,Z,Z,Z,Z,Z,Z,Z,Z,Z,Z,Z,Z,Z,Z,Z,Z,Z,Z,Z,Z,Z,Z,Z,Z,Z,Z,Z,Z,Z,Z,Z,Z,Z,Z,Z,Z,Z,Z,Z,Z,Z,Z,Z,Z,Z,Z,Z,Z,Z,Z,Z,Z,Z,Z,Z,Z,Z,Z,Z,Z,Z,Z,Z,Z,Z,Z,Z,Z,Z,Z,Z,Z,Z,Z,Z,Z,Z,Z,Z,Z,Z,Z,Z,Z,Z,Z,Z,Z,Z,Z,Z,Z,Z,Z,Z,Z,Z,Z,Z,Z,Z,Z,Z,Z,Z,Z,Z,Z,Z,Z,Z,Z,Z,Z,Z,Z,Z,Z,Z,Z,Z,Z,Z,Z,Z,Z,Z,Z,Z,Z,Z,Z,Z,Z,Z,Z,Z,Z,Z,Z,Z,Z,Z,Z,Z,Z,Z,Z,Z,Z,Z,Z,Z,Z,Z,Z,Z,Z,Z,Z,Z,Z,Z,Z,Z,Z,Z,Z,Z,Z,Z,Z,Z,Z,Z,Z,Z,Z,Z,Z,Z,Z,Z,Z,Z,10500
ABR50992AF,2,1,1,5,1,0,1,0,0,16,0,0,0,0,0,0,1,271,0,0,1,1,1,1,0,U,U,1,1,0,U,1,0,U,1,0,U,1,1,1,1,0,0,0,0,0,0,1,0,U,0,1,1,1,0,0,6,1,0,1,1,0,0.806,2,S,S,S,S,S,S,S,S,S,S,S,S,S,S,S,S,S,S,S,N,S,S,S,S,S,S,S,S,S,S,S,S,S,S,S,S,S,S,S,S,S,S,S,S,S,S,S,S,S,S,S,S,N,N,1,S,S,S,S,S,S,S,S,S,S,S,S,S,S,S,S,S,S,S,S,S,S,S,S,S,S,S,S,S,S,S,S,S,S,S,S,S,S,S,S,S,S,S,0,S,S,2,S,S,S,S,S,N,S,S,S,S,S,S,S,S,S,S,S,S,S,S,S,S,S,1,1,2,N,2,1,8,1,3,1,1,S,S,S,S,S,S,S,S,S,S,S,S,S,2,S,S,S,S,S,S,S,1,1,2,N,2,1,50,1,4,2,S,S,S,S,S,S,S,S,2,S,S,S,S,S,S,S,S,S,S,S,S,S,0,0,0,0,0,0,0,3,3,3,3,3,3,3,3,3,3,3,3,0,S,S,S,S,S,S,0,0,0,0,0,0,0,0,0,0,0,1,S,S,S,S,S,S,S,S,S,S,S,S,S,S,S,S,S,S,S,S,S,S,S,S,S,S,S,S,S,S,S,S,S,S,S,S,S,S,S,S,S,S,S,S,S,S,S,S,0,S,0,S,S,S,0,S,S,S,2,S,S,2,0,2,0,2,1,3,1,S,S,8.75,1,26,40,0,S,0,0,0,0,0,0,0,1,0,0,0,0,0,0,0,0,0,0,0,0,0,0,1,0,S,S,S,S,S,S,S,S,S,S,S,S,S,S,S,S,S,S,S,S,S,S,S,S,S,S,S,S,S,S,S,S,S,S,S,S,S,S,S,S,S,S,S,S,S,S,S,S,S,S,S,S,S,S,S,S,S,S,S,S,S,S,S,S,S,S,S,S,S,S,S,S,S,S,S,S,S,S,S,S,S,S,S,S,S,S,S,S,S,S,S,S,S,S,S,S,S,S,S,S,S,S,S,S,S,S,S,S,S,S,S,S,S,S,S,S,S,S,S,S,S,S,S,S,S,S,S,S,S,S,S,S,S,S,S,S,S,S,S,S,S,S,S,S,S,S,S,S,S,S,S,S,S,S,S,S,S,S,S,S,S,S,S,S,S,S,S,S,S,S,S,S,S,S,S,S,S,S,S,S,S,S,S,S,S,S,S,S,S,S,S,S,S,S,S,S,S,S,S,S,S,S,S,S,S,S,S,S,S,S,S,S,S,S,S,S,S,S,S,S,S,S,S,S,S,S,S,S,S,S,S,S,S,S,S,S,S,S,S,S,S,S,S,S,S,S,S,S,S,S,S,S,S,S,S,S,S,S,S,S,S,S,S,S,S,S,S,S,S,S,S,S,S,S,S,S,S,S,S,S,S,S,S,S,S,S,S,S,S,S,S,S,S,S,S,S,S,S,S,S,S,S,S,S,S,S,S,S,S,2,S,S,S,S,S,S,S,S,S,S,S,S,S,S,S,S,S,S,S,S,S,S,S,S,S,S,S,S,2,0,0,0,0,0,0,1,0,0,0,1,0,0,0,0,0,0,0,0,0,1,2,1,2,S,1,1,1,3,2,90,2,2,5,2,2,S,S,S,S,S,2,2,5,10,5,10,15,1,0,0,0,0,0,0,0,0,0,0,0,0,0,0,2,2,3,3,3,3,3,3,3,3,3,3,2,2,2,2,2,2,2,2,2,2,1,2,2,2,2,2,2,2,2,2,2,2,2,2,0,0,0,0,1,0,0,0,S,S,N,N,N,N,N,N,N,N,N,10540
ABR92091QN,1,0,Z,5,Z,Z,Z,Z,Z,Z,Z,Z,Z,Z,Z,Z,Z,Z,Z,Z,Z,Z,Z,Z,Z,Z,Z,Z,Z,Z,Z,Z,Z,Z,Z,Z,Z,Z,Z,Z,Z,Z,Z,Z,Z,Z,Z,Z,Z,Z,Z,,Z,Z,Z,Z,,,,,,Z,Z,Z,Z,Z,Z,Z,Z,Z,Z,Z,Z,Z,Z,Z,Z,Z,Z,Z,Z,Z,Z,Z,Z,Z,Z,Z,Z,Z,Z,Z,Z,Z,Z,Z,Z,Z,Z,Z,Z,Z,Z,Z,Z,Z,Z,Z,Z,Z,Z,Z,Z,Z,Z,Z,Z,Z,Z,Z,Z,Z,Z,Z,Z,Z,Z,Z,Z,Z,Z,Z,Z,Z,Z,Z,Z,Z,Z,Z,Z,Z,Z,Z,Z,Z,Z,Z,Z,Z,Z,Z,Z,Z,Z,Z,Z,Z,Z,Z,Z,Z,Z,Z,Z,Z,Z,Z,Z,Z,Z,Z,Z,Z,Z,Z,Z,Z,Z,Z,Z,Z,Z,Z,Z,Z,Z,Z,Z,Z,Z,Z,Z,Z,Z,Z,Z,Z,Z,Z,Z,Z,Z,Z,Z,Z,Z,Z,Z,Z,Z,Z,Z,Z,Z,Z,Z,Z,Z,Z,Z,Z,Z,Z,Z,Z,Z,Z,Z,Z,Z,Z,Z,Z,Z,Z,Z,Z,Z,Z,Z,Z,Z,Z,Z,Z,Z,Z,Z,Z,Z,Z,Z,Z,Z,Z,Z,Z,Z,Z,Z,Z,Z,Z,Z,Z,Z,Z,Z,Z,Z,Z,Z,Z,Z,Z,Z,Z,Z,Z,Z,Z,Z,Z,Z,Z,Z,Z,Z,Z,Z,Z,Z,Z,Z,Z,Z,Z,Z,Z,Z,Z,Z,Z,Z,Z,Z,Z,Z,Z,Z,Z,Z,Z,Z,Z,Z,Z,Z,Z,Z,Z,Z,Z,Z,Z,Z,Z,Z,Z,Z,Z,Z,Z,Z,Z,Z,Z,Z,Z,Z,Z,Z,Z,Z,Z,Z,Z,Z,Z,Z,Z,Z,Z,Z,Z,Z,Z,Z,Z,Z,Z,Z,Z,Z,Z,Z,Z,Z,Z,Z,Z,Z,Z,Z,Z,Z,Z,Z,Z,Z,Z,Z,Z,Z,Z,Z,Z,Z,Z,Z,Z,Z,Z,Z,Z,Z,Z,Z,Z,Z,Z,Z,Z,Z,Z,Z,Z,Z,Z,Z,Z,Z,Z,Z,Z,Z,Z,Z,Z,Z,Z,Z,Z,Z,Z,Z,Z,Z,Z,Z,Z,Z,Z,Z,Z,Z,Z,Z,Z,Z,Z,Z,Z,Z,Z,Z,Z,Z,Z,Z,Z,Z,Z,Z,Z,Z,Z,Z,Z,Z,Z,Z,Z,Z,Z,Z,Z,Z,Z,Z,Z,Z,Z,Z,Z,Z,Z,Z,Z,Z,Z,Z,Z,Z,Z,Z,Z,Z,Z,Z,Z,Z,Z,Z,Z,Z,Z,Z,Z,Z,Z,Z,Z,Z,Z,Z,Z,Z,Z,Z,Z,Z,Z,Z,Z,Z,Z,Z,Z,Z,Z,Z,Z,Z,Z,Z,Z,Z,Z,Z,Z,Z,Z,Z,Z,Z,Z,Z,Z,Z,Z,Z,Z,Z,Z,Z,Z,Z,Z,Z,Z,Z,Z,Z,Z,Z,Z,Z,Z,Z,Z,Z,Z,Z,Z,Z,Z,Z,Z,Z,Z,Z,Z,Z,Z,Z,Z,Z,Z,Z,Z,Z,Z,Z,Z,Z,Z,Z,Z,Z,Z,Z,Z,Z,Z,Z,Z,Z,Z,Z,Z,Z,Z,Z,Z,Z,Z,Z,Z,Z,Z,Z,Z,Z,Z,Z,Z,Z,Z,Z,Z,Z,Z,Z,Z,Z,Z,Z,Z,Z,Z,Z,Z,Z,Z,Z,Z,Z,Z,Z,Z,Z,Z,Z,Z,Z,Z,Z,Z,Z,Z,Z,Z,Z,Z,Z,Z,Z,Z,Z,Z,Z,Z,Z,Z,Z,Z,Z,Z,Z,Z,Z,Z,Z,Z,Z,Z,Z,Z,Z,Z,Z,Z,Z,Z,Z,Z,Z,Z,Z,Z,Z,Z,Z,Z,Z,Z,Z,Z,Z,Z,Z,Z,Z,Z,Z,Z,Z,Z,Z,Z,Z,Z,Z,Z,Z,Z,Z,Z,Z,Z,Z,Z,Z,Z,Z,Z,Z,Z,Z,Z,Z,Z,Z,Z,Z,Z,Z,Z,Z,Z,Z,Z,Z,Z,Z,Z,Z,Z,Z,Z,Z,Z,Z,Z,Z,Z,Z,Z,Z,Z,Z,Z,Z,Z,Z,Z,Z,Z,Z,Z,Z,Z,Z,Z,Z,Z,Z,Z,Z,Z,Z,Z,Z,Z,Z,Z,Z,Z,Z,Z,Z,Z,Z,Z,Z,Z,Z,Z,Z,Z,Z,Z,Z,Z,Z,Z,Z,Z,Z,Z,Z,Z,Z,Z,Z,Z,Z,Z,Z,Z,Z,Z,Z,Z,Z,Z,Z,Z,Z,Z,Z,Z,Z,Z,Z,Z,Z,Z,Z,Z,Z,Z,Z,Z,Z,Z,Z,10630
ABW28082CH,4,1,1,5,1,0,1,0,0,16.4,0,0,0,0,0,0,1,88,0,0,1,1,1,1,1,U,U,1,1,0,U,1,0,U,1,0,U,1,1,1,1,0,0,0,0,0,0,0,0,U,0,0,2,0,1,1,7,1,0,1,1,1,0.876,2,S,S,S,S,S,S,S,S,S,S,S,S,S,S,S,S,S,S,S,N,S,S,S,S,S,S,S,S,S,S,S,S,S,S,S,S,S,S,S,S,S,S,S,S,S,S,S,S,S,S,S,S,N,N,1,S,S,S,S,S,S,S,S,S,S,S,S,S,S,S,S,S,S,S,S,S,S,S,S,S,S,S,S,S,S,S,S,S,S,S,S,S,S,S,S,S,S,S,0,S,S,2,S,S,S,S,S,N,S,S,S,S,S,S,S,S,S,S,S,S,S,S,S,S,S,2,S,S,S,S,S,S,S,S,S,S,S,S,S,S,S,S,S,S,S,S,S,S,S,2,S,S,S,S,S,S,S,2,S,S,S,S,S,S,S,S,S,S,S,S,S,S,S,S,S,2,S,S,S,S,S,S,S,S,S,S,S,S,S,0,0,0,0,0,0,0,2,2,2,2,2,2,2,2,2,2,2,3,0,S,S,S,S,S,S,0,0,0,0,0,0,0,0,0,0,0,1,S,S,S,S,S,S,S,S,S,S,S,S,S,S,S,S,S,S,S,S,S,S,S,S,S,S,S,S,S,S,S,S,S,S,S,S,S,S,S,S,S,S,S,S,S,S,S,S,0,S,0,S,S,S,0,S,S,S,1,2,2,0,S,0,S,1,S,3,1,S,S,25,1,24,40,0,S,1,0,0,0,0,1,1,0,0,0,0,0,0,0,0,0,0,0,0,0,0,0,1,0,S,S,S,S,S,S,S,S,S,S,S,S,S,S,S,S,S,S,S,S,S,S,S,S,S,S,S,S,S,S,S,S,S,S,S,S,S,S,S,S,S,S,S,S,S,S,S,S,S,S,S,S,S,S,S,S,S,S,S,S,S,S,S,S,S,S,S,S,S,S,S,S,S,S,S,S,S,S,S,S,S,S,S,S,S,S,S,S,S,S,S,S,S,S,S,S,S,S,S,S,S,S,S,S,S,S,S,S,S,S,S,S,S,S,S,S,S,S,S,S,S,S,S,S,S,S,S,S,S,S,S,S,S,S,S,S,S,S,S,S,S,S,S,S,S,S,S,S,S,S,S,S,S,S,S,S,S,S,S,S,S,S,S,S,S,S,S,S,S,S,S,S,S,S,S,S,S,S,S,S,S,S,S,S,S,S,S,S,S,S,S,S,S,S,S,S,S,S,S,S,S,S,S,S,S,S,S,S,S,S,S,S,S,S,S,S,S,S,S,S,S,S,S,S,S,S,S,S,S,S,S,S,S,S,S,S,S,S,S,S,S,S,S,S,S,S,S,S,S,S,S,S,S,S,S,S,S,S,S,S,S,S,S,S,S,S,S,S,S,S,S,S,S,S,S,S,S,S,S,S,S,S,S,S,S,S,S,S,S,S,S,S,S,S,S,S,S,S,S,S,S,S,S,S,S,S,S,S,S,2,S,S,S,S,S,S,S,S,S,S,S,S,S,S,S,S,S,S,S,S,S,S,S,S,S,S,S,S,1,0,0,0,0,0,0,0,0,0,0,0,0,0,0,0,0,0,0,0,1,1,2,1,2,S,1,1,1,1,2,80,1,0,10,0,2,S,S,S,S,S,2,2,0,5,5,5,25,0,0,0,0,0,0,0,0,0,0,0,0,0,0,1,2,2,3,3,3,5,3,3,5,5,3,3,1,2,2,2,1,2,1,1,1,1,1,1,1,1,1,1,1,1,1,1,1,1,1,1,0,0,0,0,0,0,0,1,N,N,N,N,N,N,N,N,N,N,N,10230
ACB78560DR,1,0,Z,5,Z,Z,Z,Z,Z,Z,Z,Z,Z,Z,Z,Z,Z,Z,Z,Z,Z,Z,Z,Z,Z,Z,Z,Z,Z,Z,Z,Z,Z,Z,Z,Z,Z,Z,Z,Z,Z,Z,Z,Z,Z,Z,Z,Z,Z,Z,Z,,Z,Z,Z,Z,,,,,,Z,Z,Z,Z,Z,Z,Z,Z,Z,Z,Z,Z,Z,Z,Z,Z,Z,Z,Z,Z,Z,Z,Z,Z,Z,Z,Z,Z,Z,Z,Z,Z,Z,Z,Z,Z,Z,Z,Z,Z,Z,Z,Z,Z,Z,Z,Z,Z,Z,Z,Z,Z,Z,Z,Z,Z,Z,Z,Z,Z,Z,Z,Z,Z,Z,Z,Z,Z,Z,Z,Z,Z,Z,Z,Z,Z,Z,Z,Z,Z,Z,Z,Z,Z,Z,Z,Z,Z,Z,Z,Z,Z,Z,Z,Z,Z,Z,Z,Z,Z,Z,Z,Z,Z,Z,Z,Z,Z,Z,Z,Z,Z,Z,Z,Z,Z,Z,Z,Z,Z,Z,Z,Z,Z,Z,Z,Z,Z,Z,Z,Z,Z,Z,Z,Z,Z,Z,Z,Z,Z,Z,Z,Z,Z,Z,Z,Z,Z,Z,Z,Z,Z,Z,Z,Z,Z,Z,Z,Z,Z,Z,Z,Z,Z,Z,Z,Z,Z,Z,Z,Z,Z,Z,Z,Z,Z,Z,Z,Z,Z,Z,Z,Z,Z,Z,Z,Z,Z,Z,Z,Z,Z,Z,Z,Z,Z,Z,Z,Z,Z,Z,Z,Z,Z,Z,Z,Z,Z,Z,Z,Z,Z,Z,Z,Z,Z,Z,Z,Z,Z,Z,Z,Z,Z,Z,Z,Z,Z,Z,Z,Z,Z,Z,Z,Z,Z,Z,Z,Z,Z,Z,Z,Z,Z,Z,Z,Z,Z,Z,Z,Z,Z,Z,Z,Z,Z,Z,Z,Z,Z,Z,Z,Z,Z,Z,Z,Z,Z,Z,Z,Z,Z,Z,Z,Z,Z,Z,Z,Z,Z,Z,Z,Z,Z,Z,Z,Z,Z,Z,Z,Z,Z,Z,Z,Z,Z,Z,Z,Z,Z,Z,Z,Z,Z,Z,Z,Z,Z,Z,Z,Z,Z,Z,Z,Z,Z,Z,Z,Z,Z,Z,Z,Z,Z,Z,Z,Z,Z,Z,Z,Z,Z,Z,Z,Z,Z,Z,Z,Z,Z,Z,Z,Z,Z,Z,Z,Z,Z,Z,Z,Z,Z,Z,Z,Z,Z,Z,Z,Z,Z,Z,Z,Z,Z,Z,Z,Z,Z,Z,Z,Z,Z,Z,Z,Z,Z,Z,Z,Z,Z,Z,Z,Z,Z,Z,Z,Z,Z,Z,Z,Z,Z,Z,Z,Z,Z,Z,Z,Z,Z,Z,Z,Z,Z,Z,Z,Z,Z,Z,Z,Z,Z,Z,Z,Z,Z,Z,Z,Z,Z,Z,Z,Z,Z,Z,Z,Z,Z,Z,Z,Z,Z,Z,Z,Z,Z,Z,Z,Z,Z,Z,Z,Z,Z,Z,Z,Z,Z,Z,Z,Z,Z,Z,Z,Z,Z,Z,Z,Z,Z,Z,Z,Z,Z,Z,Z,Z,Z,Z,Z,Z,Z,Z,Z,Z,Z,Z,Z,Z,Z,Z,Z,Z,Z,Z,Z,Z,Z,Z,Z,Z,Z,Z,Z,Z,Z,Z,Z,Z,Z,Z,Z,Z,Z,Z,Z,Z,Z,Z,Z,Z,Z,Z,Z,Z,Z,Z,Z,Z,Z,Z,Z,Z,Z,Z,Z,Z,Z,Z,Z,Z,Z,Z,Z,Z,Z,Z,Z,Z,Z,Z,Z,Z,Z,Z,Z,Z,Z,Z,Z,Z,Z,Z,Z,Z,Z,Z,Z,Z,Z,Z,Z,Z,Z,Z,Z,Z,Z,Z,Z,Z,Z,Z,Z,Z,Z,Z,Z,Z,Z,Z,Z,Z,Z,Z,Z,Z,Z,Z,Z,Z,Z,Z,Z,Z,Z,Z,Z,Z,Z,Z,Z,Z,Z,Z,Z,Z,Z,Z,Z,Z,Z,Z,Z,Z,Z,Z,Z,Z,Z,Z,Z,Z,Z,Z,Z,Z,Z,Z,Z,Z,Z,Z,Z,Z,Z,Z,Z,Z,Z,Z,Z,Z,Z,Z,Z,Z,Z,Z,Z,Z,Z,Z,Z,Z,Z,Z,Z,Z,Z,Z,Z,Z,Z,Z,Z,Z,Z,Z,Z,Z,Z,Z,Z,Z,Z,Z,Z,Z,Z,Z,Z,Z,Z,Z,Z,Z,Z,Z,Z,Z,Z,Z,Z,Z,Z,Z,Z,Z,Z,Z,Z,Z,Z,Z,Z,Z,Z,Z,Z,Z,Z,Z,Z,Z,Z,Z,Z,Z,Z,Z,Z,Z,Z,Z,Z,Z,Z,Z,Z,Z,Z,Z,Z,Z,Z,Z,Z,Z,Z,Z,Z,Z,Z,Z,Z,Z,Z,Z,Z,Z,Z,Z,Z,Z,Z,Z,Z,Z,Z,Z,Z,Z,Z,Z,Z,Z,Z,Z,Z,Z,Z,Z,Z,Z,Z,Z,Z,Z,Z,Z,Z,Z,Z,Z,Z,Z,Z,10280
ACD92089ZY,1,0,Z,5,Z,Z,Z,Z,Z,Z,Z,Z,Z,Z,Z,Z,Z,Z,Z,Z,Z,Z,Z,Z,Z,Z,Z,Z,Z,Z,Z,Z,Z,Z,Z,Z,Z,Z,Z,Z,Z,Z,Z,Z,Z,Z,Z,Z,Z,Z,Z,,Z,Z,Z,Z,,,,,,Z,Z,Z,Z,Z,Z,Z,Z,Z,Z,Z,Z,Z,Z,Z,Z,Z,Z,Z,Z,Z,Z,Z,Z,Z,Z,Z,Z,Z,Z,Z,Z,Z,Z,Z,Z,Z,Z,Z,Z,Z,Z,Z,Z,Z,Z,Z,Z,Z,Z,Z,Z,Z,Z,Z,Z,Z,Z,Z,Z,Z,Z,Z,Z,Z,Z,Z,Z,Z,Z,Z,Z,Z,Z,Z,Z,Z,Z,Z,Z,Z,Z,Z,Z,Z,Z,Z,Z,Z,Z,Z,Z,Z,Z,Z,Z,Z,Z,Z,Z,Z,Z,Z,Z,Z,Z,Z,Z,Z,Z,Z,Z,Z,Z,Z,Z,Z,Z,Z,Z,Z,Z,Z,Z,Z,Z,Z,Z,Z,Z,Z,Z,Z,Z,Z,Z,Z,Z,Z,Z,Z,Z,Z,Z,Z,Z,Z,Z,Z,Z,Z,Z,Z,Z,Z,Z,Z,Z,Z,Z,Z,Z,Z,Z,Z,Z,Z,Z,Z,Z,Z,Z,Z,Z,Z,Z,Z,Z,Z,Z,Z,Z,Z,Z,Z,Z,Z,Z,Z,Z,Z,Z,Z,Z,Z,Z,Z,Z,Z,Z,Z,Z,Z,Z,Z,Z,Z,Z,Z,Z,Z,Z,Z,Z,Z,Z,Z,Z,Z,Z,Z,Z,Z,Z,Z,Z,Z,Z,Z,Z,Z,Z,Z,Z,Z,Z,Z,Z,Z,Z,Z,Z,Z,Z,Z,Z,Z,Z,Z,Z,Z,Z,Z,Z,Z,Z,Z,Z,Z,Z,Z,Z,Z,Z,Z,Z,Z,Z,Z,Z,Z,Z,Z,Z,Z,Z,Z,Z,Z,Z,Z,Z,Z,Z,Z,Z,Z,Z,Z,Z,Z,Z,Z,Z,Z,Z,Z,Z,Z,Z,Z,Z,Z,Z,Z,Z,Z,Z,Z,Z,Z,Z,Z,Z,Z,Z,Z,Z,Z,Z,Z,Z,Z,Z,Z,Z,Z,Z,Z,Z,Z,Z,Z,Z,Z,Z,Z,Z,Z,Z,Z,Z,Z,Z,Z,Z,Z,Z,Z,Z,Z,Z,Z,Z,Z,Z,Z,Z,Z,Z,Z,Z,Z,Z,Z,Z,Z,Z,Z,Z,Z,Z,Z,Z,Z,Z,Z,Z,Z,Z,Z,Z,Z,Z,Z,Z,Z,Z,Z,Z,Z,Z,Z,Z,Z,Z,Z,Z,Z,Z,Z,Z,Z,Z,Z,Z,Z,Z,Z,Z,Z,Z,Z,Z,Z,Z,Z,Z,Z,Z,Z,Z,Z,Z,Z,Z,Z,Z,Z,Z,Z,Z,Z,Z,Z,Z,Z,Z,Z,Z,Z,Z,Z,Z,Z,Z,Z,Z,Z,Z,Z,Z,Z,Z,Z,Z,Z,Z,Z,Z,Z,Z,Z,Z,Z,Z,Z,Z,Z,Z,Z,Z,Z,Z,Z,Z,Z,Z,Z,Z,Z,Z,Z,Z,Z,Z,Z,Z,Z,Z,Z,Z,Z,Z,Z,Z,Z,Z,Z,Z,Z,Z,Z,Z,Z,Z,Z,Z,Z,Z,Z,Z,Z,Z,Z,Z,Z,Z,Z,Z,Z,Z,Z,Z,Z,Z,Z,Z,Z,Z,Z,Z,Z,Z,Z,Z,Z,Z,Z,Z,Z,Z,Z,Z,Z,Z,Z,Z,Z,Z,Z,Z,Z,Z,Z,Z,Z,Z,Z,Z,Z,Z,Z,Z,Z,Z,Z,Z,Z,Z,Z,Z,Z,Z,Z,Z,Z,Z,Z,Z,Z,Z,Z,Z,Z,Z,Z,Z,Z,Z,Z,Z,Z,Z,Z,Z,Z,Z,Z,Z,Z,Z,Z,Z,Z,Z,Z,Z,Z,Z,Z,Z,Z,Z,Z,Z,Z,Z,Z,Z,Z,Z,Z,Z,Z,Z,Z,Z,Z,Z,Z,Z,Z,Z,Z,Z,Z,Z,Z,Z,Z,Z,Z,Z,Z,Z,Z,Z,Z,Z,Z,Z,Z,Z,Z,Z,Z,Z,Z,Z,Z,Z,Z,Z,Z,Z,Z,Z,Z,Z,Z,Z,Z,Z,Z,Z,Z,Z,Z,Z,Z,Z,Z,Z,Z,Z,Z,Z,Z,Z,Z,Z,Z,Z,Z,Z,Z,Z,Z,Z,Z,Z,Z,Z,Z,Z,Z,Z,Z,Z,Z,Z,Z,Z,Z,Z,Z,Z,Z,Z,Z,Z,Z,Z,Z,Z,Z,Z,Z,Z,Z,Z,Z,Z,Z,Z,Z,Z,Z,Z,Z,Z,Z,Z,Z,Z,Z,Z,Z,Z,Z,Z,Z,Z,Z,Z,Z,Z,Z,Z,Z,Z,Z,Z,Z,Z,Z,Z,Z,Z,Z,Z,Z,Z,Z,Z,Z,Z,Z,Z,Z,Z,Z,Z,Z,Z,Z,Z,10170