HIS_GENERAL,CHR_HYPEV,CHR_CHLEV,CHR_CHLEV_R,CHR_ASEV,CHR_CANEV,ADHD_EVER,ADHD_AGE,ADHD_NOW,ADHD_TREAT,ADHD_MEDS,ADHD_MEDDIFF,ADHD_MED_NSTM,ADHD_MED_STM,ADHD_MED_OLD,ADHD_MED_OTH,ADHD_RXMED_C1,ADHD_RXMED_C2,ADHD_RXMED_C3,ADHD_RXMED_C4,ADHD_RXMED_C5,ADHD_RXMED_C6,ADHD_RXMED_C7,ADHD_RXMED_C8,ADHD_RXMED_C9,ADHD_RXMED_C10,ADHD_OLD_C1,ADHD_OLD_C2,ADHD_OLD_C3,ADHD_OLD_C4,ADHD_WM_NA,ADHD_INS,ADHD_TELE,ADHD_DIAG,ADHD_FIRST,ADHD_TELERX,ADHD_COUNSEL,ADHD_INSPAY,ADHD_RX3M,ADHD_CNSEL3M,SOC_ERRANDS,SOC_PARACTIV,SOC_PARACTIV_R,SOC_SCWRKLIM,SOCWRKLMT,PAY_BILL12M,PAY_PAYWORRY,THC_TRANSPOR,THC_HOUSCOST,INT_ACCESS,INT_HOMEACC,INT_USEMED,INT_USEDOC,INT_USETEST,ONL_SOCMED,ONL_GAMES,ONL_MSGBOARD,ONL_SOCISO,ONL_SOCCOM,ONL_GAMESISO,ONL_GAMESCOM,ONL_MSGISO,ONL_MSGCOM,ACC_HTHLAST,ACC_HTHUSUAL,ACC_HTHTYPE,ACC_HOSP12M,MED_RX12MA,MED_RXSK12MA,MED_RXLS12MA,MED_RXDL12MA,MED_RXDG12MA,CON_SEX12M,CON_BCIUD,CON_BCSHOT,CON_BCPILL,CON_BCEC,CON_BCSTERIL,CON_BCOTHER,CON_BCNONE,CON_BCCHANGE,CON_CHNGEWHYA,CON_CHNGEWHYA_O,CON_CHNGEWHYB,CON_CHNGEWHYB_O,CON_CHNGEWHYC,CON_CHNGEWHYC_O,CON_CHNGEWHYD,CON_CHNGEWHYD_O,CON_CHNGEWHYE,CON_CHNGEWHYE_O,CON_CHNGEWHYF,CON_CHNGEWHYF_O,CON_CHNGEWHYG,CON_CHNGEWHYG_O,CON_CHNGEWHYH,CON_CHNGEWHYH_O,CON_IUD12M,CON_SHOTS12M,CON_BCPILLS12M,CON_EMERG12M,PAI_FREQ3M,PAI_AMNT,PAI_WKLM3M,CPN_MEDCARE,CPN_TRTDEC,CPN_RESPECT,CPN_LISTEN,CPN_OPINION,HRD_ONLPILLS,HRD_CONCERNA,HRD_CONCERNB,HRD_NALOXONE,HRD_NALOTC,HRD_GETNACOM,HRD_GETNADR,HRD_GETNAHD,HRD_GETNARX,HRD_CARRYNAL,HRD_DKWRK,HRD_DKUSE,HRD_DKWHERE,HRD_NABUS,HRD_NACOL,HRD_NAELMMD,HRD_NAHS,HRD_NAWRSHP,HRD_NALIB,HRD_RELDRUG,HRD_BLAME,HRD_JOBDRUG,IMM_SHTPNUEV,IMM_SHTFLU12,MTL_MHRXA,MTL_MHTHRPY,MTL_MHTPYNOW,HCA_MHTHDLY,HCA_MHTND,MTH_PHQ41,MTH_PHQ42,MTH_PHQ43,MTH_PHQ44,GAD2SCREEN,PHQ2SCREEN,CIG_SMKEV,CIG_SMKNOW,SWM_SKILLLVL,SWM_PRVLESS,SWM_GRPLESS,SWM_FRREL,SWM_TCHSELF,SWM_EVERLESS,SWM_DAYSPOOL,SWM_ALCPOOL,SWM_DAYSBOAT,SWM_ALCBOAT,SWM_CPR,SWM_CPR2Y,SWM_HELPDRWN,SUI_THKSUI12,SUI_KNOWSUI,TSV_PHOTOEV,TSV_THREATEV,TSV_THRTPIC,TSV_THRTSEX,TSV_THRTPAY,TSV_THRTREL,TSV_THRTOTH,TSV_FAKEPORN,EMP_EMPLOY,EMP_ABSENTWK,EMP_DAYMISS_R,EMP_WHYNOWRK,EMP_WHENWRK,EMPWRKLSWK,HPF_EVERUSE,HPF_KNOWFIT,HPF_EVERFIT,HPF_IMPORT,HPF_IMPORTDK,MAR_MARITAL,MAR_EVMARRY,MAR_LEGAL,MAR_WIDIVSEP,MARSTAT,LEGMSTAT,MARITAL,CIV_VOL12M,CIV_VOLOTH,CIV_MEET,CIV_VOTELOCL,CIVIC_ENGAGE,LAN_OTHERLAN,LAN_MEDIA,LAN_DOCTOR,LAN_SOCIAL,TEL_NONCELL,TEL_CELL,TEL_HHCELL,START_DATE_R,END_DATE_R,ID_R,SOURCE,QUEX_LANG,P_OUTCOME,P_AGEC_R,P_HHSIZE_R,P_GENDER,P_EDUCATION_I_R,P_EDUCATION_I_IFLG,P_INCOME_I_R,P_INCOME_I_R_IFLG,P_ONEVISIT,P_RACE_R,P_REMIND,P_CATIATT,P_DEVICE,P_MODE,P_VISIT,P_POVERTY,P_EMPLOY,P_MARITAL,P_REGION,P_HOMEOWN,P_CITIZEN,P_VETERAN,P_INSUR,P_USBORN,P_GENDERID,P_ORIENT,P_METRO_R,P_METRO_R_IFLG,P1_CALWT_M1,P2_CALWT_M1,WEIGHT_M1,P_STRATA_R,P_PSU_R
3,1,1,1,0,0,0,-8,-8,-8,-8,-8,-8,-8,-8,0,-8,-8,-8,-8,-8,-8,-8,-8,-8,-8,-8,-8,-8,-8,-8,-8,-8,-8,-8,-8,-8,-8,-8,-8,1,1,1,0,0,0,2,0,0,1,1,1,1,1,1,1,0,4,1,3,4,-8,-8,1,1,1,0,1,0,0,0,0,-8,-8,-8,-8,-8,-8,-8,-8,-8,-8,-8,-8,-8,-8,-8,-8,-8,-8,-8,-8,-8,-8,-8,-8,-8,-8,-8,-8,-8,1,1,0,-8,-8,-8,-8,-8,0,-8,4,1,1,0,1,1,1,0,0,1,1,1,1,0,1,1,1,4,2,4,1,1,0,0,-8,0,0,1,0,1,0,2,2,0,-8,3,0,1,0,0,-8,1,3,1,0,1,0,0,0,1,0,0,-8,-8,-8,-8,-8,0,0,0,-8,0,1,0,2,0,-8,-8,3,3,1,-8,1,2,5,2,1,-8,0,1,1,0,-8,-8,-8,0,1,-8,OCT23,OCT23,100001,1,1,3,61,1,2,3,0,11,2,1,3,0,,1,1,1,9,1,3,4,1,,0,,,2,2,1,0,21386.548713,,5581.1921981,2026,110635
3,1,-6,-8,0,0,0,-8,-8,-8,-8,-8,-8,-8,-8,0,-8,-8,-8,-8,-8,-8,-8,-8,-8,-8,-8,-8,-8,-8,-8,-8,-8,-8,-8,-8,-8,-8,-8,-8,1,2,1,1,1,1,1,1,0,1,1,1,1,1,1,1,0,4,1,4,1,-8,-8,1,1,1,0,1,0,0,0,0,-8,-8,-8,-8,-8,-8,-8,-8,-8,-8,-8,-8,-8,-8,-8,-8,-8,-8,-8,-8,-8,-8,-8,-8,-8,-8,-8,-8,-8,2,3,3,1,1,3,-6,3,0,-8,4,1,1,1,0,1,1,0,0,0,1,1,1,1,1,1,1,4,1,4,0,1,0,1,0,0,0,0,0,0,0,2,2,1,3,4,0,0,0,1,0,2,0,0,-8,1,0,1,0,1,0,0,-8,-8,-8,-8,-8,0,0,0,-8,3,3,0,0,1,-8,3,-8,3,1,-8,2,3,2,2,1,-8,0,1,1,0,-8,-8,-8,0,1,-8,OCT23,OCT23,100002,2,1,3,60,2,2,2,0,5,0,1,1,0,,2,1,1,3,2,2,3,1,1,0,1,1,2,2,1,0,,47285.7517,34945.711612,999,105584
2,1,0,0,1,0,0,-8,-8,-8,-8,-8,-8,-8,-8,0,-8,-8,-8,-8,-8,-8,-8,-8,-8,-8,-8,-8,-8,-8,-8,-8,-8,-8,-8,-8,-8,-8,-8,-8,2,2,1,1,1,1,2,1,1,1,1,1,1,1,1,2,2,3,2,2,3,3,3,1,1,1,0,0,-8,-8,-8,0,0,-8,-8,-8,-8,-8,-8,-8,-8,-8,-8,-8,-8,-8,-8,-8,-8,-8,-8,-8,-8,-8,-8,-8,-8,-8,-8,-8,-8,0,-8,-8,-8,-8,-8,-8,-8,0,-8,2,1,0,1,0,1,1,0,0,1,0,0,0,0,0,0,0,4,3,2,1,0,0,0,-8,0,1,0,0,0,0,2,2,0,-8,1,0,1,-8,-8,-8,0,-8,0,-8,0,-8,0,0,0,0,0,-8,-8,-8,-8,-8,0,0,0,-8,5,1,0,0,0,-8,-8,1,3,0,-8,-8,5,4,2,0,0,0,0,2,0,-8,-8,-8,1,1,-8,OCT23,OCT23,100003,1,1,3,26,2,2,3,0,2,0,0,2,0,,1,1,2,1,1,4,4,2,,0,,,2,2,1,0,34778.55172,,9076.0685198,2084,110554
2,1,1,1,1,0,-6,-8,-8,-8,-8,-8,-8,-8,-8,0,-8,-8,-8,-8,-8,-8,-8,-8,-8,-8,-8,-8,-8,-8,-8,-8,-8,-8,-8,-8,-8,-8,-8,-8,2,4,2,1,1,1,3,0,0,1,0,0,0,0,3,0,0,3,4,-8,-8,-8,-8,5,2,-8,0,0,-8,-8,-8,0,-8,-8,-8,-8,-8,-8,-8,-8,-8,-8,-8,-8,-8,-8,-8,-8,-8,-8,-8,-8,-8,-8,-8,-8,-8,-8,-8,-8,-8,3,3,2,0,-8,-8,-8,-8,1,2,-8,0,-8,-8,-8,-8,-8,-8,-8,-8,-8,-8,-8,-8,-8,-8,-8,4,3,4,0,0,0,-6,-8,0,0,3,3,0,0,2,1,0,-8,4,0,0,0,0,0,2,3,1,2,1,1,1,1,0,0,0,-8,-8,-8,-8,-8,0,0,0,-8,5,4,0,0,0,-8,-8,3,2,0,-8,-8,6,4,2,0,0,0,0,2,0,-8,-8,-8,0,0,0,NOV23,NOV23,100004,1,1,3,25,6,1,1,0,7,0,1,4,3,,2,1,1,2,1,4,2,1,,0,1,0,1,2,1,0,34591.826954,,9027.3394414,2009,110018
2,1,0,0,0,0,0,-8,-8,-8,-8,-8,-8,-8,-8,0,-8,-8,-8,-8,-8,-8,-8,-8,-8,-8,-8,-8,-8,-8,-8,-8,-8,-8,-8,-8,-8,-8,-8,-8,1,1,1,0,0,0,3,-6,0,1,0,0,0,0,3,0,3,4,4,-8,-8,3,3,1,-6,-8,0,0,-8,-8,-8,0,0,-8,-8,-8,-8,-8,-8,-8,-8,-8,-8,-8,-8,-8,-8,-8,-8,-8,-8,-8,-8,-8,-8,-8,-8,-8,-8,-8,-8,0,-8,-8,-8,-8,-8,-8,-8,0,-8,1,0,-8,-8,-8,-8,-8,-8,-8,-8,-8,-8,-8,-8,-8,-8,-8,4,1,4,0,0,0,0,-8,0,0,3,2,2,3,1,1,0,-8,4,-6,1,0,0,-8,1,3,2,2,0,-8,-9,0,-6,0,0,-8,-8,-8,-8,-8,0,0,0,-8,7,4,0,2,0,-8,-8,3,2,-6,-8,-8,6,4,2,-6,-8,1,-6,1,0,-8,-8,-8,-6,0,0,OCT23,OCT23,100005,1,1,3,34,5,2,2,0,8,0,1,4,0,,2,1,1,3,1,2,4,2,,0,,1,2,,1,0,6843.6891747,,1785.9798297,2054,110018
4,1,1,1,1,0,0,-8,-8,-8,-8,-8,-8,-8,-8,0,-8,-8,-8,-8,-8,-8,-8,-8,-8,-8,-8,-8,-8,-8,-8,-8,-8,-8,-8,-8,-8,-8,-8,-8,1,1,1,0,0,0,3,0,0,1,1,1,1,1,2,0,0,3,3,-8,-8,-8,-8,1,1,1,0,1,0,0,0,0,-8,-8,-8,-8,-8,-8,-8,-8,-8,-8,-8,-8,-8,-8,-8,-8,-8,-8,-8,-8,-8,-8,-8,-8,-8,-8,-8,-8,-8,1,3,1,-8,-8,-8,-8,-8,0,-8,4,1,0,0,0,0,0,0,0,1,1,0,0,0,0,0,0,4,3,4,0,0,0,0,-8,0,0,0,0,0,0,2,2,0,-8,3,0,0,1,0,0,1,0,0,-8,0,-8,0,0,1,0,0,-8,-8,-8,-8,-8,0,0,0,-8,2,3,0,2,0,-8,-8,3,3,1,-8,2,3,2,2,0,0,0,1,1,0,-8,-8,-8,0,1,-8,OCT23,OCT23,100006,2,1,3,70,1,2,1,0,9,0,1,1,1,,3,1,1,7,3,2,3,1,1,0,1,1,2,2,1,0,,42807.386467,31636.053748,999,102264
3,0,0,0,0,0,0,-8,-8,-8,-8,-8,-8,-8,-8,0,-8,-8,-8,-8,-8,-8,-8,-8,-8,-8,-8,-8,-8,-8,-8,-8,-8,-8,-8,-8,-8,-8,-8,-8,1,2,1,0,1,0,2,1,1,1,1,0,0,0,1,2,0,4,1,4,2,-8,-8,2,2,-8,0,0,-8,-8,-8,0,1,0,0,0,0,1,0,0,-8,-8,-8,-8,-8,-8,-8,-8,-8,-8,-8,-8,-8,-8,-8,-8,-8,-8,-8,-8,-8,1,1,1,-8,-8,-8,-8,-8,0,-8,1,1,1,1,1,1,1,0,0,0,0,1,1,0,1,1,0,4,4,4,0,0,0,0,-8,0,0,1,1,1,1,2,2,0,-8,4,0,0,1,0,0,0,-8,0,-8,0,-8,0,0,1,0,0,-8,-8,-8,-8,-8,0,0,1,0,-8,1,1,0,1,-8,3,-8,3,1,-8,2,3,2,2,0,0,-6,0,-8,0,-8,-8,-8,0,1,-8,NOV23,NOV23,100007,1,1,3,44,4,2,1,0,1,0,1,1,2,,2,1,1,1,1,2,3,1,,0,0,1,2,2,2,0,176618.64999,,46091.711411,2024,110018
3,1,0,0,0,0,0,-8,-8,-8,-8,-8,-8,-8,-8,0,-8,-8,-8,-8,-8,-8,-8,-8,-8,-8,-8,-8,-8,-8,-8,-8,-8,-8,-8,-8,-8,-8,-8,-8,1,1,1,0,0,0,3,0,0,1,1,0,0,0,2,3,0,4,3,4,4,-8,-8,1,1,1,0,1,0,0,0,0,-8,-8,-8,-8,-8,-8,-8,-8,-8,-8,-8,-8,-8,-8,-8,-8,-8,-8,-8,-8,-8,-8,-8,-8,-8,-8,-8,-8,-8,0,-8,-8,-8,-8,-8,-8,-8,0,-8,4,1,0,0,0,0,0,0,0,0,1,1,1,0,0,0,0,4,1,4,1,1,1,0,-8,0,0,0,0,0,0,2,2,1,3,3,0,1,0,0,-8,0,-8,0,-8,0,-8,1,0,1,0,0,-8,-8,-8,-8,-8,0,1,-8,0,-8,1,1,1,1,0,3,-8,3,1,-8,2,3,2,2,0,0,0,1,1,0,-8,-8,-8,0,1,-8,OCT23,OCT23,100008,2,1,3,70,1,1,1,0,7,0,1,1,0,,2,1,1,5,1,2,4,1,1,0,1,1,1,2,1,0,,63161.451727,46678.371342,999,105519
2,1,0,0,0,0,0,-8,-8,-8,-8,-8,-8,-8,-8,0,-8,-8,-8,-8,-8,-8,-8,-8,-8,-8,-8,-8,-8,-8,-8,-8,-8,-8,-8,-8,-8,-8,-8,-8,1,1,1,0,0,0,2,0,0,1,1,1,1,1,1,0,2,3,2,-8,-8,3,2,1,3,1,0,1,0,0,0,0,-8,-8,-8,-8,-8,-8,-8,-8,-8,-8,-8,-8,-8,-8,-8,-8,-8,-8,-8,-8,-8,-8,-8,-8,-8,-8,-8,-8,-8,1,1,0,-8,-8,-8,-8,-8,0,-8,4,0,-8,-8,-8,-8,-8,-8,-8,-8,-8,-8,-8,-8,-8,-8,-8,4,2,4,1,0,0,0,-8,0,0,1,0,0,0,2,2,0,-8,3,1,0,0,0,-8,0,-8,0,-8,1,0,0,0,0,0,0,-8,-8,-8,-8,-8,0,0,0,-8,4,3,0,0,0,-8,-8,2,1,-8,-8,-8,1,3,1,1,-8,0,1,1,0,-8,-8,-8,1,1,-8,OCT23,OCT23,100009,1,1,3,64,1,2,3,0,16,0,1,1,1,,1,1,1,9,3,1,2,1,1,0,1,1,3,2,1,0,79851.691656,,20838.68905,2040,110436
2,1,0,0,0,0,0,-8,-8,-8,-8,-8,-8,-8,-8,0,-8,-8,-8,-8,-8,-8,-8,-8,-8,-8,-8,-8,-8,-8,-8,-8,-8,-8,-8,-8,-8,-8,-8,-8,1,1,1,0,0,0,3,0,0,1,1,0,0,0,0,0,0,-8,-8,-8,-8,-8,-8,1,1,1,0,1,0,0,0,0,-8,-8,-8,-8,-8,-8,-8,-8,-8,-8,-8,-8,-8,-8,-8,-8,-8,-8,-8,-8,-8,-8,-8,-8,-8,-8,-8,-8,-8,0,-8,-8,-8,-8,-8,-8,-8,0,-8,4,1,0,0,0,0,0,0,0,0,0,0,0,0,0,0,0,4,1,4,0,0,0,0,-8,0,0,0,0,0,0,2,2,0,-8,4,0,0,0,1,0,0,-8,1,0,0,-8,0,0,0,0,0,-8,-8,-8,-8,-8,0,1,-8,-7,-8,1,1,-6,0,-8,-8,2,1,-8,-8,-8,1,3,1,0,0,0,0,2,0,-8,-8,-8,0,1,-8,OCT23,OCT23,100010,2,1,3,42,3,1,1,0,8,2,0,1,1,,2,1,7,4,1,1,1,1,1,0,1,1,1,2,1,0,,124217.32417,91800.650968,999,101098
2,0,0,0,0,0,0,-8,-8,-8,-8,-8,-8,-8,-8,0,-8,-8,-8,-8,-8,-8,-8,-8,-8,-8,-8,-8,-8,-8,-8,-8,-8,-8,-8,-8,-8,-8,-8,-8,1,1,1,0,0,0,3,0,0,1,1,1,1,1,3,3,1,3,2,3,2,3,2,4,1,1,0,0,-8,-8,-8,0,-8,-8,-8,-8,-8,-8,-8,-8,-8,-8,-8,-8,-8,-8,-8,-8,-8,-8,-8,-8,-8,-8,-8,-8,-8,-8,-8,-8,-8,0,-8,-8,-8,-8,-8,-8,-8,0,-8,3,0,-8,-8,-8,-8,-8,-8,-8,-8,-8,-8,-8,-8,-8,-8,-8,4,1,4,0,0,0,0,-8,0,0,0,0,0,0,2,2,0,-8,4,0,0,0,1,0,1,0,1,0,0,-8,0,0,0,0,1,1,0,1,0,0,0,1,-8,0,-8,1,1,1,1,0,3,-8,3,0,-8,-8,5,4,2,0,0,0,0,2,1,2,1,1,0,1,-8,NOV23,NOV23,100011,1,1,3,27,6,1,2,0,11,0,1,4,2,,1,1,1,4,4,4,3,1,,0,1,1,1,2,1,0,7293.0441208,,1903.2468255,2003,110635
2,1,1,1,0,1,0,-8,-8,-8,-8,-8,-8,-8,-8,0,-8,-8,-8,-8,-8,-8,-8,-8,-8,-8,-8,-8,-8,-8,-8,-8,-8,-8,-8,-8,-8,-8,-8,-8,1,1,1,0,0,0,3,0,-6,1,1,1,1,1,0,0,0,-8,-8,-8,-8,-8,-8,1,1,1,0,1,0,0,0,0,-8,-8,-8,-8,-8,-8,-8,-8,-8,-8,-8,-8,-8,-8,-8,-8,-8,-8,-8,-8,-8,-8,-8,-8,-8,-8,-8,-8,-8,2,3,1,1,1,3,3,3,0,-8,4,1,1,1,0,1,1,0,0,0,0,1,1,1,1,1,1,4,1,4,1,1,0,0,-8,0,0,0,0,0,0,2,2,0,-8,4,0,0,0,1,0,3,0,3,0,0,-8,0,0,0,0,0,-8,-8,-8,-8,-8,0,0,0,-8,2,2,0,1,1,0,2,-8,1,-8,-8,-8,1,3,1,0,0,0,1,1,0,-8,-8,-8,0,1,-8,OCT23,OCT23,100012,2,1,3,69,2,1,3,0,14,0,1,1,0,,1,1,1,9,3,1,3,1,1,1,1,1,1,2,1,0,,32368.310169,23921.236141,999,101411
4,0,1,1,0,0,0,-8,-8,-8,-8,-8,-8,-8,-8,0,-8,-8,-8,-8,-8,-8,-8,-8,-8,-8,-8,-8,-8,-8,-8,-8,-8,-8,-8,-8,-8,-8,-8,-8,1,1,1,1,1,-6,2,0,0,1,1,1,1,1,1,0,0,4,2,-8,-8,-8,-8,1,1,1,0,1,0,0,0,0,-8,-8,-8,-8,-8,-8,-8,-8,-8,-8,-8,-8,-8,-8,-8,-8,-8,-8,-8,-8,-8,-8,-8,-8,-8,-8,-8,-8,-8,3,2,1,0,-8,-8,-8,-8,0,-8,3,1,1,0,0,1,1,0,-6,-6,-6,0,0,0,0,0,0,4,3,4,0,0,0,0,-8,0,0,0,0,0,0,2,2,1,1,3,0,0,1,0,0,0,-8,0,-8,0,-8,0,0,0,0,0,-8,-8,-8,-8,-8,0,0,0,-8,3,1,0,1,0,-8,-8,3,1,-8,-8,-8,1,3,1,0,0,0,0,2,0,-8,-8,-8,0,1,-8,OCT23,OCT23,100013,1,1,3,63,3,1,2,0,7,0,1,1,0,,1,1,1,3,3,1,3,1,1,1,1,1,1,2,1,0,19307.251237,,5038.563324,2083,110018
3,1,1,1,0,0,1,-6,0,-8,-8,-8,-8,-8,-8,0,-8,-8,-8,-8,-8,-8,-8,-8,-8,-8,-8,-8,-8,-8,-8,-8,-8,-8,-8,-8,-8,-8,-8,-8,1,1,1,0,0,0,2,0,0,1,1,1,1,1,1,0,1,1,2,-8,-8,3,2,1,3,2,0,1,0,0,0,0,-8,-8,-8,-8,-8,-8,-8,-8,-8,-8,-8,-8,-8,-8,-8,-8,-8,-8,-8,-8,-8,-8,-8,-8,-8,-8,-8,-8,-8,1,3,0,-8,-8,-8,-8,-8,0,-8,4,0,-8,-8,-8,-8,-8,-8,-8,-8,-8,-8,-8,-8,-8,-8,-8,4,1,2,0,1,0,0,-8,0,0,0,0,1,0,2,2,0,-8,2,0,0,0,0,0,1,0,1,3,0,-8,1,0,0,0,0,-8,-8,-8,-8,-8,0,-6,-8,-8,-8,-8,-8,1,0,-8,-8,3,1,-8,-8,-8,1,3,1,0,0,0,0,2,1,2,1,2,1,1,-8,OCT23,OCT23,100014,2,2,3,51,5,2,2,0,13,0,0,4,2,,2,1,3,6,1,1,4,1,0,0,1,,2,2,1,0,,50729.912753,37491.05888,999,100760
1,0,0,0,0,-6,0,-8,-8,-8,-8,-8,-8,-8,-8,0,-8,-8,-8,-8,-8,-8,-8,-8,-8,-8,-8,-8,-8,-8,-8,-8,-8,-8,-8,-8,-8,-8,-8,-8,1,1,1,0,0,0,1,0,0,1,1,0,0,0,1,2,0,3,3,3,3,-8,-8,5,2,-8,0,0,-8,-8,-8,0,-8,-8,-8,-8,-8,-8,-8,-8,-8,-8,-8,-8,-8,-8,-8,-8,-8,-8,-8,-8,-8,-8,-8,-8,-8,-8,-8,-8,-8,0,-8,-8,-8,-8,-8,-8,-8,0,-8,1,0,-8,-8,-8,-8,-8,-8,-8,-8,-8,-8,-8,-8,-8,-8,-8,4,3,3,0,0,0,0,-8,0,0,0,0,0,0,2,2,0,-8,4,0,0,0,1,0,1,3,2,3,0,-8,0,0,1,0,0,-8,-8,-8,-8,-8,0,1,-8,0,-8,1,1,1,0,-8,-8,3,1,-8,-8,-8,1,3,1,0,0,0,0,2,1,2,2,2,0,1,-8,OCT23,OCT23,100015,2,2,3,30,6,1,1,0,15,0,1,4,0,,1,1,1,7,1,1,3,1,1,0,0,0,1,2,1,0,,76516.350209,56548.076574,999,105692
4,1,1,1,0,0,0,-8,-8,-8,-8,-8,-8,-8,-8,0,-8,-8,-8,-8,-8,-8,-8,-8,-8,-8,-8,-8,-8,-8,-8,-8,-8,-8,-8,-8,-8,-8,-8,-8,2,-9,-8,1,1,0,3,1,0,0,-8,-8,-8,-8,0,0,0,-8,-8,-8,-8,-8,-8,1,1,1,1,1,0,0,0,0,-8,-8,-8,-8,-8,-8,-8,-8,-8,-8,-8,-8,-8,-8,-8,-8,-8,-8,-8,-8,-8,-8,-8,-8,-8,-8,-8,-8,-8,3,1,1,1,1,2,2,1,0,-8,-7,1,0,0,0,0,1,0,-7,0,-7,-9,-9,0,0,-9,0,4,-9,4,-9,1,-9,0,-8,0,0,0,-9,1,0,2,-8,0,-8,-9,1,0,1,0,-8,0,-8,0,-8,0,-8,0,0,-9,0,0,-8,-8,-8,-8,-8,0,1,-8,5,-8,1,1,1,1,1,3,-8,3,1,-8,2,3,2,2,0,0,1,1,1,0,-8,-8,-8,0,1,-8,OCT23,NOV23,100016,1,1,3,62,1,2,3,0,1,0,0,1,2,2,5,2,2,1,4,2,2,2,,0,1,1,2,2,1,0,9710.7738804,,2534.1954958,2025,110635
4,1,1,1,1,0,0,-8,-8,-8,-8,-8,-8,-8,-8,0,-8,-8,-8,-8,-8,-8,-8,-8,-8,-8,-8,-8,-8,-8,-8,-8,-8,-8,-8,-8,-8,-8,-8,-8,2,1,1,0,1,0,1,0,1,1,1,1,1,1,1,2,0,3,3,3,3,-8,-8,2,1,1,0,0,-8,-8,-8,1,-8,-8,-8,-8,-8,-8,-8,-8,-8,-8,-8,-8,-8,-8,-8,-8,-8,-8,-8,-8,-8,-8,-8,-8,-8,-8,-8,-8,-8,3,3,1,0,-8,-8,-8,-8,-6,-8,-8,0,-8,-8,-8,-8,-8,-8,-8,-8,-8,-8,-8,-8,-8,-8,-8,4,2,2,0,0,0,0,-8,0,0,1,1,2,1,1,2,1,3,4,0,0,0,1,0,0,-8,1,2,0,-8,-9,0,1,0,0,-8,-8,-8,-8,-8,0,1,-8,3,-8,1,1,1,1,1,3,-8,2,0,-8,-8,6,4,2,0,0,0,0,2,0,-8,-8,-8,0,1,-8,OCT23,OCT23,100017,1,1,3,49,4,1,1,0,6,0,1,3,0,,2,1,1,2,1,4,4,2,,0,1,1,1,2,1,0,48229.872426,,12586.424828,2024,110635
3,0,1,1,0,0,0,-8,-8,-8,-8,-8,-8,-8,-8,0,-8,-8,-8,-8,-8,-8,-8,-8,-8,-8,-8,-8,-8,-8,-8,-8,-8,-8,-8,-8,-8,-8,-8,-8,3,3,2,0,1,0,3,0,0,1,1,1,1,1,2,1,0,4,2,4,1,-8,-8,1,1,1,0,1,0,0,0,0,-8,-8,-8,-8,-8,-8,-8,-8,-8,-8,-8,-8,-8,-8,-8,-8,-8,-8,-8,-8,-8,-8,-8,-8,-8,-8,-8,-8,-8,1,1,1,-8,-8,-8,-8,-8,0,-8,4,1,1,1,0,1,1,0,0,1,0,1,1,1,1,1,1,4,2,4,1,0,0,0,-8,0,0,0,0,1,0,2,2,1,3,1,0,0,-8,-8,0,0,-8,0,-8,0,-8,0,0,1,0,0,-8,-8,-8,-8,-8,0,0,0,-8,2,3,0,2,0,-8,-8,3,1,-8,-8,-8,1,3,1,0,0,0,1,1,0,-8,-8,-8,1,1,-8,OCT23,OCT23,100018,1,1,3,70,2,2,1,0,9,0,1,1,0,,2,1,1,5,3,1,2,1,1,0,1,1,2,2,1,0,37937.603966,,9900.4781983,2049,110143
2,0,0,0,0,0,0,-8,-8,-8,-8,-8,-8,-8,-8,0,-8,-8,-8,-8,-8,-8,-8,-8,-8,-8,-8,-8,-8,-8,-8,-8,-8,-8,-8,-8,-8,-8,-8,-8,1,2,1,0,1,0,1,0,0,1,1,1,1,1,1,2,3,3,3,3,3,3,3,1,1,1,0,1,0,0,0,0,1,0,0,1,0,0,0,0,0,-8,-8,-8,-8,-8,-8,-8,-8,-8,-8,-8,-8,-8,-8,-8,-8,-8,-8,3,-8,2,2,2,1,1,3,2,1,0,-8,4,1,0,0,0,0,0,0,0,1,1,0,0,0,0,0,0,4,1,4,1,0,0,1,1,0,0,0,0,0,0,2,2,1,3,2,0,0,0,0,0,0,-8,0,-8,0,-8,0,1,1,1,1,0,1,0,1,0,0,1,-8,5,-8,1,1,2,0,-8,-8,3,2,0,-8,-8,6,4,2,0,0,0,0,2,0,-8,-8,-8,0,1,-8,OCT23,OCT23,100019,2,1,3,25,2,2,2,0,8,0,1,1,0,,2,1,1,4,1,4,1,2,1,0,1,1,2,2,1,0,,116387.15499,86013.900752,999,104705
3,0,1,1,0,0,0,-8,-8,-8,-8,-8,-8,-8,-8,0,-8,-8,-8,-8,-8,-8,-8,-8,-8,-8,-8,-8,-8,-8,-8,-8,-8,-8,-8,-8,-8,-8,-8,-8,1,1,1,0,0,0,3,0,0,1,1,1,1,1,1,1,1,2,2,2,2,2,3,1,1,1,0,1,0,0,0,1,-8,-8,-8,-8,-8,-8,-8,-8,-8,-8,-8,-8,-8,-8,-8,-8,-8,-8,-8,-8,-8,-8,-8,-8,-8,-8,-8,-8,-8,2,1,1,1,1,1,3,1,0,-8,2,1,1,1,1,1,1,0,0,0,0,1,1,1,1,1,1,4,1,2,0,1,0,0,-8,0,0,0,0,0,0,2,2,1,3,3,0,0,1,1,0,1,2,0,-8,0,-8,0,0,1,0,0,-8,-8,-8,-8,-8,0,1,-8,0,-8,1,1,1,1,0,2,-8,1,-8,-8,-8,1,3,1,0,0,1,1,1,0,-8,-8,-8,0,1,-8,OCT23,OCT23,100020,2,1,3,49,2,1,1,0,14,0,1,1,0,,2,1,1,9,1,1,2,1,1,0,1,1,1,2,1,0,,28540.132556,21092.08812,999,105985
2,0,0,0,0,0,0,-8,-8,-8,-8,-8,-8,-8,-8,0,-8,-8,-8,-8,-8,-8,-8,-8,-8,-8,-8,-8,-8,-8,-8,-8,-8,-8,-8,-8,-8,-8,-8,-8,1,1,1,0,0,0,2,0,0,1,1,0,0,0,2,0,0,3,3,-8,-8,-8,-8,2,2,-8,0,1,0,0,0,0,-8,-8,-8,-8,-8,-8,-8,-8,-8,-8,-8,-8,-8,-8,-8,-8,-8,-8,-8,-8,-8,-8,-8,-8,-8,-8,-8,-8,-8,0,-8,-8,-8,-8,-8,-8,-8,0,-8,4,0,-8,-8,-8,-8,-8,-8,-8,-8,-8,-8,-8,-8,-8,-8,-8,4,1,4,0,1,0,0,-8,0,0,0,0,0,0,2,2,1,2,2,0,0,1,1,0,1,3,1,3,0,-8,0,0,0,0,0,-8,-8,-8,-8,-8,0,1,-8,0,-8,1,1,2,0,-8,-8,3,3,0,-8,-8,5,4,2,0,0,0,0,2,0,-8,-8,-8,0,1,-8,OCT23,OCT23,100021,2,1,3,53,2,2,1,0,11,0,1,4,0,,2,1,1,7,1,4,3,3,1,0,0,1,2,1,1,0,,71179.624779,52604.06255,999,105232
2,1,0,0,1,1,0,-8,-8,-8,-8,-8,-8,-8,-8,0,-8,-8,-8,-8,-8,-8,-8,-8,-8,-8,-8,-8,-8,-8,-8,-8,-8,-8,-8,-8,-8,-8,-8,-8,1,2,1,0,1,0,2,0,0,1,1,1,1,1,3,0,3,3,2,-8,-8,3,2,3,1,1,0,1,0,1,0,0,-8,-8,-8,-8,-8,-8,-8,-8,-8,-8,-8,-8,-8,-8,-8,-8,-8,-8,-8,-8,-8,-8,-8,-8,-8,-8,-8,-8,-8,1,1,1,-8,-8,-8,-8,-8,0,-8,4,1,1,1,1,1,0,1,-8,-8,-8,1,1,1,1,1,1,4,2,4,0,1,0,0,-8,0,0,1,0,1,2,1,2,1,3,4,0,1,1,0,-8,0,-8,1,0,1,0,1,0,1,0,0,-8,-8,-8,-8,-8,0,1,-8,0,-8,1,1,1,1,0,3,-8,1,-8,-8,-8,1,3,1,1,-8,1,1,1,0,-8,-8,-8,1,1,-8,OCT23,OCT23,100022,1,1,3,55,5,1,3,0,15,0,1,3,0,,1,1,1,8,1,1,4,1,,0,,,1,2,1,0,324249.06626,,84618.438587,2006,110276
3,0,1,1,0,0,0,-8,-8,-8,-8,-8,-8,-8,-8,0,-8,-8,-8,-8,-8,-8,-8,-8,-8,-8,-8,-8,-8,-8,-8,-8,-8,-8,-8,-8,-8,-8,-8,-8,1,1,1,0,0,0,2,0,0,1,1,0,0,0,2,0,0,4,4,-8,-8,-8,-8,2,1,1,0,1,0,0,0,0,-8,-8,-8,-8,-8,-8,-8,-8,-8,-8,-8,-8,-8,-8,-8,-8,-8,-8,-8,-8,-8,-8,-8,-8,-8,-8,-8,-8,-8,2,3,0,0,-8,-8,-8,-8,0,-8,4,1,0,0,0,0,0,0,1,1,1,0,1,0,1,0,1,4,1,4,0,0,0,0,-8,0,0,0,0,0,0,2,2,0,-8,3,0,0,0,0,1,0,-8,0,-8,0,-8,0,0,0,0,0,-8,-8,-8,-8,-8,0,1,-8,0,-8,1,1,0,0,-8,-8,3,3,0,-8,-8,5,4,2,0,0,0,1,1,0,-8,-8,-8,0,1,-8,OCT23,OCT23,100023,2,1,3,58,1,1,2,0,11,0,1,1,0,,2,1,1,9,1,4,1,1,1,0,,1,1,2,1,0,,44404.287036,32816.215314,999,103308
4,1,0,0,0,1,0,-8,-8,-8,-8,-8,-8,-8,-8,0,-8,-8,-8,-8,-8,-8,-8,-8,-8,-8,-8,-8,-8,-8,-8,-8,-8,-8,-8,-8,-8,-8,-8,-8,2,4,2,1,1,0,2,0,0,1,1,1,1,1,0,0,3,-8,-8,-8,-8,4,3,1,3,1,0,1,0,0,1,0,-8,-8,-8,-8,-8,-8,-8,-8,-8,-8,-8,-8,-8,-8,-8,-8,-8,-8,-8,-8,-8,-8,-8,-8,-8,-8,-8,-8,-8,3,3,1,0,-8,-8,-8,-8,0,-8,4,1,0,0,0,0,1,0,0,0,0,1,1,1,1,1,1,4,4,3,0,0,0,0,-8,0,1,1,1,1,1,2,2,1,2,2,0,1,0,0,-8,0,-8,0,-8,0,-8,0,1,1,0,0,-8,-8,-8,-8,-8,0,0,0,-8,7,3,0,1,0,-8,-8,2,3,0,-8,-8,5,4,2,0,0,0,1,1,0,-8,-8,-8,1,0,-8,OCT23,OCT23,100024,2,1,3,70,1,2,3,0,9,0,1,1,0,,1,1,1,7,2,4,2,1,1,0,1,1,2,2,1,0,,32709.209383,24173.171771,999,106047
1,0,0,0,0,0,0,-8,-8,-8,-8,-8,-8,-8,-8,0,-8,-8,-8,-8,-8,-8,-8,-8,-8,-8,-8,-8,-8,-8,-8,-8,-8,-8,-8,-8,-8,-8,-8,-8,1,1,1,0,0,0,3,0,0,1,1,1,0,0,1,0,0,4,4,-8,-8,-8,-8,1,1,1,0,1,0,0,0,0,-8,-8,-8,-8,-8,-8,-8,-8,-8,-8,-8,-8,-8,-8,-8,-8,-8,-8,-8,-8,-8,-8,-8,-8,-8,-8,-8,-8,-8,1,3,0,-8,-8,-8,-8,-8,0,-8,4,1,0,0,0,0,0,0,-6,-6,-6,-6,1,1,1,0,1,4,2,4,1,1,0,0,-8,0,0,0,0,0,0,2,2,0,-8,4,0,0,0,1,0,0,-8,0,-8,0,-8,0,0,1,0,0,-8,-8,-8,-8,-8,0,0,0,-8,2,3,0,2,0,-8,-8,3,1,-8,-8,-8,1,3,1,1,-8,0,1,1,0,-8,-8,-8,1,1,-8,OCT23,OCT23,100025,2,1,3,70,2,1,3,0,6,0,1,1,0,,1,1,1,3,3,1,4,1,1,0,1,1,1,2,1,0,,49100.474301,36286.850758,999,101004
2,1,0,0,0,0,0,-8,-8,-8,-8,-8,-8,-8,-8,0,-8,-8,-8,-8,-8,-8,-8,-8,-8,-8,-8,-8,-8,-8,-8,-8,-8,-8,-8,-8,-8,-8,-8,-8,1,1,1,0,0,0,2,0,0,1,1,1,0,1,1,0,0,3,2,-8,-8,-8,-8,1,1,1,0,1,0,0,0,0,-8,-8,-8,-8,-8,-8,-8,-8,-8,-8,-8,-8,-8,-8,-8,-8,-8,-8,-8,-8,-8,-8,-8,-8,-8,-8,-8,-8,-8,1,1,0,-8,-8,-8,-8,-8,0,-8,3,0,-8,-8,-8,-8,-8,-8,-8,-8,-8,-8,-8,-8,-8,-8,-8,4,1,3,0,0,0,0,-8,0,0,0,0,0,0,2,2,0,-8,3,0,0,0,0,1,2,2,0,-8,1,0,1,0,1,0,0,-8,-8,-8,-8,-8,0,1,-8,0,-8,1,1,0,0,-8,-8,2,3,1,-8,2,3,2,2,1,-8,0,1,1,0,-8,-8,-8,0,1,-8,OCT23,OCT23,100026,2,1,3,55,1,2,2,0,16,0,1,1,0,,2,1,1,9,1,2,3,1,1,0,1,1,2,2,1,0,,59168.399543,43727.375639,999,101335
3,1,0,0,0,0,1,1,1,0,0,-8,-8,-8,-8,0,-8,-8,-8,-8,-8,-8,-8,-8,-8,-8,-8,-8,-8,-8,-8,0,0,-8,-8,-8,-8,-8,-8,-8,1,1,1,1,1,1,3,0,1,1,1,1,1,1,1,1,2,3,2,4,1,4,2,1,1,4,1,1,0,0,0,0,-8,-8,-8,-8,-8,-8,-8,-8,-8,-8,-8,-8,-8,-8,-8,-8,-8,-8,-8,-8,-8,-8,-8,-8,-8,-8,-8,-8,-8,2,3,2,1,1,3,3,3,0,-8,4,1,1,1,1,1,1,0,1,1,1,1,1,1,1,1,1,4,1,4,1,0,1,1,1,0,0,0,0,0,0,2,2,1,3,4,0,1,1,0,-8,0,-8,1,0,1,0,1,0,1,0,0,-8,-8,-8,-8,-8,0,1,-8,0,-8,1,1,0,1,-8,3,-8,1,-8,-8,-8,1,3,1,0,0,0,0,2,0,-8,-8,-8,0,1,-8,NOV23,NOV23,100027,1,1,3,23,3,1,2,0,10,0,1,1,4,,2,1,1,5,1,1,2,2,,1,,,1,2,2,0,90432.751372,,23600.000785,2095,110635
1,0,0,0,0,0,0,-8,-8,-8,-8,-8,-8,-8,-8,0,-8,-8,-8,-8,-8,-8,-8,-8,-8,-8,-8,-8,-8,-8,-8,-8,-8,-8,-8,-8,-8,-8,-8,-8,1,1,1,0,0,0,3,0,0,1,1,0,1,1,1,1,0,4,1,4,1,-8,-8,1,1,1,0,1,0,0,0,0,-8,-8,-8,-8,-8,-8,-8,-8,-8,-8,-8,-8,-8,-8,-8,-8,-8,-8,-8,-8,-8,-8,-8,-8,-8,-8,-8,-8,-8,0,-8,-8,-8,-8,-8,-8,-8,0,-8,4,1,1,0,1,1,1,0,-6,-6,-6,-6,-6,-6,-6,-6,-6,-6,-6,-6,1,1,0,0,-8,0,0,0,0,0,0,2,2,0,-8,3,1,1,0,0,-8,-6,-8,-6,-8,-6,-8,-6,0,0,0,0,-8,-8,-8,-8,-8,0,0,0,-8,2,3,0,2,0,-8,-8,3,3,0,-8,-8,5,4,2,0,0,0,1,1,1,1,1,1,1,0,-8,OCT23,OCT23,100028,2,1,3,70,1,1,3,0,16,2,1,,0,,1,1,1,9,4,4,1,1,1,0,1,1,,,1,0,,58247.800033,43047.022597,999,103494
3,1,1,1,0,0,0,-8,-8,-8,-8,-8,-8,-8,-8,0,-8,-8,-8,-8,-8,-8,-8,-8,-8,-8,-8,-8,-8,-8,-8,-8,-8,-8,-8,-8,-8,-8,-8,-8,2,2,1,1,1,1,1,1,1,1,1,1,1,0,0,1,0,-8,-8,4,2,-8,-8,2,3,1,0,1,1,1,0,0,-8,-8,-8,-8,-8,-8,-8,-8,-8,-8,-8,-8,-8,-8,-8,-8,-8,-8,-8,-8,-8,-8,-8,-8,-8,-8,-8,-8,-8,3,3,1,0,-8,-8,-8,-8,0,-8,4,1,1,1,1,1,1,1,-8,-8,-8,1,1,0,1,0,1,3,2,2,0,0,0,0,-8,0,0,0,0,0,0,2,2,1,3,4,0,1,0,0,-8,0,-8,0,-8,1,0,1,0,1,0,0,-8,-8,-8,-8,-8,0,1,-8,0,-8,1,1,1,1,0,2,-8,1,-8,-8,-8,1,3,1,0,0,0,1,1,0,-8,-8,-8,0,1,-8,OCT23,OCT23,100029,2,1,3,50,6,1,1,0,12,0,1,1,0,,2,1,1,4,2,1,3,2,1,0,1,1,1,2,1,0,,38814.793114,28685.397137,999,102467
2,1,0,0,0,0,0,-8,-8,-8,-8,-8,-8,-8,-8,0,-8,-8,-8,-8,-8,-8,-8,-8,-8,-8,-8,-8,-8,-8,-8,-8,-8,-8,-8,-8,-8,-8,-8,-8,1,1,1,0,0,0,2,0,0,1,1,1,0,0,1,0,0,4,3,-8,-8,-8,-8,1,1,1,0,1,0,0,0,0,-8,-8,-8,-8,-8,-8,-8,-8,-8,-8,-8,-8,-8,-8,-8,-8,-8,-8,-8,-8,-8,-8,-8,-8,-8,-8,-8,-8,-8,1,3,1,-8,-8,-8,-8,-8,0,-8,3,1,0,0,0,0,0,0,0,0,0,0,0,0,0,0,0,4,2,3,0,0,0,0,-8,0,0,0,0,0,0,2,2,0,-8,1,0,0,-8,-8,0,1,1,1,1,0,-8,0,0,0,0,0,-8,-8,-8,-8,-8,0,1,-8,1,-8,1,1,2,0,-8,-8,3,1,-8,-8,-8,1,3,1,0,0,0,0,2,0,-8,-8,-8,0,1,-8,OCT23,OCT23,100030,2,1,3,55,1,2,1,0,11,0,1,3,0,,2,1,1,9,1,1,3,1,1,0,0,0,2,2,1,0,,107754.7609,79634.280173,999,101527
4,0,0,0,0,0,0,-8,-8,-8,-8,-8,-8,-8,-8,0,-8,-8,-8,-8,-8,-8,-8,-8,-8,-8,-8,-8,-8,-8,-8,-8,-8,-8,-8,-8,-8,-8,-8,-8,1,1,1,0,0,0,2,0,0,1,1,1,1,1,1,2,0,4,2,4,3,-8,-8,1,3,1,0,1,0,0,0,0,-8,-8,-8,-8,-8,-8,-8,-8,-8,-8,-8,-8,-8,-8,-8,-8,-8,-8,-8,-8,-8,-8,-8,-8,-8,-8,-8,-8,-8,1,1,1,-8,-8,-8,-8,-8,0,-8,1,0,-8,-8,-8,-8,-8,-8,-8,-8,-8,-8,-8,-8,-8,-8,-8,4,2,4,0,0,0,0,-8,0,0,0,0,1,1,2,2,0,-8,4,0,0,1,0,0,1,0,1,0,0,-8,0,0,0,1,0,-8,-8,-8,-8,-8,0,1,-8,0,-8,1,1,1,0,-8,-8,3,1,-8,-8,-8,1,3,1,0,0,0,0,2,1,3,3,3,1,0,0,OCT23,OCT23,100031,1,1,3,34,2,1,3,0,15,0,1,3,1,,1,1,1,9,1,1,4,2,,0,,,1,2,1,0,89347.058494,,23316.670328,2026,110018
2,0,0,0,0,0,0,-8,-8,-8,-8,-8,-8,-8,-8,0,-8,-8,-8,-8,-8,-8,-8,-8,-8,-8,-8,-8,-8,-8,-8,-8,-8,-8,-8,-8,-8,-8,-8,-8,1,1,1,0,0,0,3,0,0,1,1,1,1,1,1,2,0,3,3,3,3,-8,-8,1,3,1,0,1,1,1,1,1,1,0,0,0,0,1,0,0,-8,-8,-8,-8,-8,-8,-8,-8,-8,-8,-8,-8,-8,-8,-8,-8,-8,-8,-8,-8,-8,1,3,0,-8,-8,-8,-8,-8,0,-8,4,1,1,1,1,1,0,0,0,0,1,1,1,1,1,1,1,-6,2,4,0,1,1,0,-8,0,0,1,0,1,0,2,2,0,-8,3,0,1,0,0,-8,2,3,1,0,1,1,1,0,1,0,0,-8,-8,-8,-8,-8,0,1,-8,5,-8,1,1,2,1,-8,3,-8,1,-8,-8,-8,1,3,1,1,-8,0,1,1,0,-8,-8,-8,1,1,-8,OCT23,OCT23,100032,1,1,3,42,6,2,3,0,15,0,1,1,0,,2,1,1,7,1,1,3,1,1,0,1,0,2,2,1,0,243192.11632,,63465.216406,2108,110018
2,0,0,0,0,0,0,-8,-8,-8,-8,-8,-8,-8,-8,0,-8,-8,-8,-8,-8,-8,-8,-8,-8,-8,-8,-8,-8,-8,-8,-8,-8,-8,-8,-8,-8,-8,-8,-8,1,1,1,0,0,1,1,1,1,1,1,1,1,1,1,1,2,2,3,2,3,2,3,1,1,2,0,1,1,1,1,1,-8,-8,-8,-8,-8,-8,-8,-8,-8,-8,-8,-8,-8,-8,-8,-8,-8,-8,-8,-8,-8,-8,-8,-8,-8,-8,-8,-8,-8,1,1,0,-8,-8,-8,-8,-8,0,-8,2,1,0,0,0,0,0,0,0,1,1,1,1,1,1,1,1,4,3,3,1,0,0,0,-8,0,0,0,0,1,0,2,2,0,-8,4,1,0,1,0,-8,1,0,1,0,1,0,0,0,1,0,0,-8,-8,-8,-8,-8,0,1,-8,4,-8,1,1,1,0,-8,-8,3,1,-8,-8,-8,1,3,1,1,-8,0,1,1,0,-8,-8,-8,0,1,-8,OCT23,OCT23,100033,2,1,3,26,2,1,2,0,11,0,1,1,1,,1,1,1,7,1,1,3,2,1,0,1,1,1,2,1,0,,113999.48512,84249.334898,999,100283
3,0,0,0,0,0,1,2,1,0,0,-8,-8,-8,-8,0,-8,-8,-8,-8,-8,-8,-8,-8,-8,-8,-8,-8,-8,-8,-8,0,1,2,0,0,0,-8,-8,-8,1,2,1,0,1,1,1,1,0,1,1,1,0,0,1,0,0,4,2,-8,-8,-8,-8,1,3,1,0,0,-8,-8,-8,0,-8,-8,-8,-8,-8,-8,-8,-8,-8,-8,-8,-8,-8,-8,-8,-8,-8,-8,-8,-8,-8,-8,-8,-8,-8,-8,-8,-8,-8,0,-8,-8,-8,-8,-8,-8,-8,0,-8,4,1,0,0,1,0,0,0,0,1,1,1,1,1,1,1,1,4,4,3,0,1,0,0,-8,0,0,1,1,1,1,2,2,0,-8,3,0,1,1,0,-8,0,-8,0,-8,0,-8,0,0,0,0,0,-8,-8,-8,-8,-8,0,1,-8,2,-8,1,1,2,0,-8,-8,3,3,0,-8,-8,5,4,2,0,0,0,1,1,0,-8,-8,-8,0,1,-8,OCT23,OCT23,100034,2,1,3,21,4,1,2,0,5,0,1,1,2,,2,1,1,2,1,4,3,1,1,0,1,1,3,2,1,0,,111953.16526,82737.03783,999,105716