{"text_format":"1","workbook":"xlsx","n_sheets":13,"sheets":["ReadMe","Template","Summary","Goal1","Goal2","Goal3","Notes","Save_As","Back End Data (Activities)","Back End Data (Outcomes)","Back End (Passthrough)","Back End (Tracker)","Back End Data (Dropdrop)"],"not_rendered":{"charts":0,"images":3,"macros":1,"external_links":1,"defined_names":18,"comments":0,"pivot_tables":0},"unopened":[],"bounds":{"document_bytes":16777216,"sheet_cells":100000,"rows_first":2000,"rows_last":500,"rows_between":2000,"halvings":0,"cell_chars":16384,"cell_head_chars":4096},"cells_cut":0,"cells_raw":0,"read":"whole","date_system":"1900"}

{"sheet":"ReadMe","index":0,"n_rows":1,"n_cols":2,"rows_kept":1,"cut":false,"hidden":false,"merged":[]}
[null,"Accessible Version: https://www.cdc.gov/hai/hai-ar-programs/resources/local-strategy/index.html for 508c content "]

{"sheet":"Template","index":1,"n_rows":14,"n_cols":14,"rows_kept":14,"cut":false,"hidden":false,"merged":[[3,5,3,8],[3,10,3,13],[2,1,2,3],[25,1,25,3],[3,1,3,3],[6,1,6,3],[4,3,5,3],[7,1,11,3],[5,1,5,2],[13,1,22,3]]}
[null,null,null,null,null,null,null,null,null,null,"still need to add sort feature"]
[]
[null,"Planning Selector",null,null,null,"Menu of Recommended of Activities",null,null,null,null,"Preview of Selected Activities"]
[null,"Instructions: Select a goal from the drop down in cell C5. The goal, objective, and expected outcomes will auto-populate. Once you have selected a goal, select the Run button [step 2]. ",null,null,null,"Instructions: Use the Activity Status Column to select if an activity is underway or planned. Then select the Plan button [step 3]. ",null,null,null,null,"Instructions: Review your selected activities. Once confirmed, select the Add to Goal Button [step 4] and then visit the Summary Tab. If you would like to complete the worksheet for another Goal, then go to the Template Tab and select the red RESET button. Now select a different goal from the drop down and repeat the steps."]
[null,"Goal",null,{"$f":"_xlfn.IFNA(VLOOKUP(C5,'Back End Data (Dropdrop)'!$B$3:$C$5,2,FALSE),\"\")","v":""},null,"Objective: ","Level","Recommended Activities","Activity Status",null,"Objective: ","Level","Recommended Activities","Activity Status"]
[]
[null,"Objectives"]
[null,{"$f":"_xlfn.IFNA(VLOOKUP(C5,'Back End Data (Dropdrop)'!$I$16:$J$19,2,FALSE),\"\")","v":""}]
[]
[]
[]
[]
[null,"Outcomes"]
[null,{"$f":"_xlfn.IFNA(VLOOKUP(C5,'Back End Data (Outcomes)'!$G$6:$H$8,2,FALSE),\"\")","v":""}]

{"sheet":"Summary","index":2,"n_rows":15,"n_cols":10,"rows_kept":15,"cut":false,"hidden":false,"merged":[[2,8,3,9],[1,1,1,4]]}
[null,null,"Need to add a sort"]
[null,"Summary "]
[null,"Objective: ","Level","Recommended Activities","Activity Status",null,null,null,{"$f":"\"Your health department has used this planning tool for \"&COUNTIF(Summary!J5:J15,\"X\")&\" out of 11 objectives\"","v":"Your health department has used this planning tool for 0 out of 11 objectives"}]
[]
[null,null,null,null,null,null,null,null,"Objective 1.1",{"$f":"IF(COUNTIF(Summary!B:B,Summary!I5)>0,\"X\",\" \")","v":" "}]
[null,null,null,null,null,null,null,null,"Objective 1.2",{"$f":"IF(COUNTIF(Summary!B:B,Summary!I6)>0,\"X\",\" \")","v":" "}]
[null,null,null,null,null,null,null,null,"Objective 1.3",{"$f":"IF(COUNTIF(Summary!B:B,Summary!I7)>0,\"X\",\" \")","v":" "}]
[null,null,null,null,null,null,null,null,"Objective 2.1",{"$f":"IF(COUNTIF(Summary!B:B,Summary!I8)>0,\"X\",\" \")","v":" "}]
[null,null,null,null,null,null,null,null,"Objective 2.2",{"$f":"IF(COUNTIF(Summary!B:B,Summary!I9)>0,\"X\",\" \")","v":" "}]
[null,null,null,null,null,null,null,null,"Objective 2.3",{"$f":"IF(COUNTIF(Summary!B:B,Summary!I10)>0,\"X\",\" \")","v":" "}]
[null,null,null,null,null,null,null,null,"Objective 2.4",{"$f":"IF(COUNTIF(Summary!B:B,Summary!I11)>0,\"X\",\" \")","v":" "}]
[null,null,null,null,null,null,null,null,"Objective 3.1",{"$f":"IF(COUNTIF(Summary!B:B,Summary!I12)>0,\"X\",\" \")","v":" "}]
[null,null,null,null,null,null,null,null,"Objective 3.2",{"$f":"IF(COUNTIF(Summary!B:B,Summary!I13)>0,\"X\",\" \")","v":" "}]
[null,null,null,null,null,null,null,null,"Objective 3.3",{"$f":"IF(COUNTIF(Summary!B:B,Summary!I14)>0,\"X\",\" \")","v":" "}]
[null,null,null,null,null,null,null,null,"Objective 3.4",{"$f":"IF(COUNTIF(Summary!B:B,Summary!I15)>0,\"X\",\" \")","v":" "}]

{"sheet":"Goal1","index":3,"n_rows":3,"n_cols":5,"rows_kept":3,"cut":false,"hidden":false,"merged":[[1,1,1,4]]}
[]
[null,"Goal 1"]
[null,"Objective: ","Level","Recommended Activities","Activity Status"]

{"sheet":"Goal2","index":4,"n_rows":3,"n_cols":5,"rows_kept":3,"cut":false,"hidden":false,"merged":[[1,1,1,4]]}
[]
[null,"Goal 2"]
[null,"Objective: ","Level","Recommended Activities","Activity Status"]

{"sheet":"Goal3","index":5,"n_rows":3,"n_cols":5,"rows_kept":3,"cut":false,"hidden":false,"merged":[[1,1,1,4]]}
[]
[null,"Goal 3"]
[null,"Objective: ","Level","Recommended Activities","Activity Status"]

{"sheet":"Notes","index":6,"n_rows":0,"n_cols":0,"rows_kept":0,"cut":false,"hidden":false,"merged":[]}

{"sheet":"Save_As","index":7,"n_rows":2,"n_cols":2,"rows_kept":2,"cut":false,"hidden":true,"merged":[]}
["File folder","C:\\Users\\bpezzulo\\Documents\\DHQP\\VBA\\"]
["File name","11.22.21"]

{"sheet":"Back End Data (Activities)","index":8,"n_rows":303,"n_cols":9,"rows_kept":303,"cut":false,"hidden":true,"merged":[]}
[]
[]
[null,"Goal","Objective","Level","Level Category","UID","Recommended Activities","Check if Activity is Underway","Check if Activity is Planned for Implementation"]
[null,1,"Objective 1.1",1,1,{"$f":"\"Goal_\"&B4&\":\"&D4","v":"Goal_1:1"},"Discuss the state ELC HAI/AR workplan and priorities with the state HAI/AR Program lead."]
[null,1,"Objective 1.1",1,1,"Goal_1:1","Discuss how the state HAI/AR program has historically worked with the LHD or other LHDs within the state."]
[null,1,"Objective 1.1",1,1,"Goal_1:1","Discuss state and local roles and responsibilities for HAI/AR activities and available funding for LHD."]
[null,1,"Objective 1.1",1,1,"Goal_1:1","Establish a plan for regular ongoing communications between the LHD and the state HAI/AR Program or other state or regional points of contact."]
[null,1,"Objective 1.1",1,1,"Goal_1:1","Identify a process for regular information sharing between state HAI/AR program and LHD."]
[null,1,"Objective 1.1",1,1,"Goal_1:1","Increase LHD’s awareness of the key positions within the state HAI/AR Program (see also Goal 2, Objective 2.1). "]
[null,1,"Objective 1.1",2,1,"Goal_1:2","Discuss the state ELC HAI/AR workplan and priorities with the state HAI/AR Program lead."]
[null,1,"Objective 1.1",2,1,"Goal_1:2","Discuss how the state HAI/AR program has historically worked with the LHD or other LHDs within the state."]
[null,1,"Objective 1.1",2,1,"Goal_1:2","Discuss state and local roles and responsibilities for HAI/AR activities and available funding for LHD."]
[null,1,"Objective 1.1",2,1,"Goal_1:2","Establish a plan for regular ongoing communications between the LHD and the state HAI/AR Program or other state or regional points of contact."]
[null,1,"Objective 1.1",2,1,"Goal_1:2","Identify a process for regular information sharing between state HAI/AR program and LHD."]
[null,1,"Objective 1.1",2,1,"Goal_1:2","Increase LHD’s awareness of the key positions within the state HAI/AR Program (see also Goal 2, Objective 2.1). "]
[null,1,"Objective 1.1",2,2,"Goal_1:2","Determine options, such as rotating membership, for LHD or regional representative(s) to participate in state HAI/AR Program led workgroups, e.g., state HAI/AR advisory committee or other state-wide HAI/AR coalitions."]
[null,1,"Objective 1.1",2,2,"Goal_1:2","Define new activities and establish expectations from both state and local perspectives (e.g., how do we want to work together; what are our objectives; how will we measure success?)."]
[null,1,"Objective 1.1",3,1,"Goal_1:3","Discuss the state ELC HAI/AR workplan and priorities with the state HAI/AR Program lead."]
[null,1,"Objective 1.1",3,1,"Goal_1:3","Discuss how the state HAI/AR program has historically worked with the LHD or other LHDs within the state."]
[null,1,"Objective 1.1",3,1,"Goal_1:3","Discuss state and local roles and responsibilities for HAI/AR activities and available funding for LHD."]
[null,1,"Objective 1.1",3,1,"Goal_1:3","Establish a plan for regular ongoing communications between the LHD and the state HAI/AR Program or other state or regional points of contact."]
[null,1,"Objective 1.1",3,1,"Goal_1:3","Identify a process for regular information sharing between state HAI/AR program and LHD."]
[null,1,"Objective 1.1",3,1,"Goal_1:3","Increase LHD’s awareness of the key positions within the state HAI/AR Program (see also Goal 2, Objective 2.1). "]
[null,1,"Objective 1.1",3,2,"Goal_1:3","Determine options, such as rotating membership, for LHD or regional representative(s) to participate in state HAI/AR Program led workgroups, e.g., state HAI/AR advisory committee or other state-wide HAI/AR coalitions"]
[null,1,"Objective 1.1",3,2,"Goal_1:3","Define new activities and establish expectations from both state and local perspectives (e.g., how do we want to work together; what are our objectives; how will we measure success?)."]
[null,1,"Objective 1.1",3,3,"Goal_1:3","Develop a local or regional HAI/AR steering group or advisory committee with key partners (e.g., local boards of health, state HAI/AR program representatives, local Association for Professionals in Infection Control (APIC) chapters, local long-term care affiliates). "]
[null,1,"Objective 1.1",3,3,"Goal_1:3","Establish a communication cadence and pathway for keeping state HAI/AR program informed of local steering group activities and receiving feedback from the state."]
[null,1,"Objective 1.2",2,1,"Goal_1:2","Coordinate with the state HAI/AR Program to determine which healthcare settings, facilities, or providers are priorities for LHD support (e.g., based on cases, infection rates, outbreaks etc.) and for what purpose (see also Goal 2, Objective 2.2)."]
[null,1,"Objective 1.2",2,1,"Goal_1:2","Identify healthcare facilities within the jurisdiction, including but not limited to facilities that are licensed by the state and including those serving at- risk populations."]
[null,1,"Objective 1.2",2,1,"Goal_1:2","Establish regular contact with healthcare facilities and providers."]
[null,1,"Objective 1.2",2,2,"Goal_1:2","Develop and maintain local contact lists to include infection preventionists, Directors of Nursing, and representatives from key settings or provider types. First check with the state HAI/AR Program or licensing group to determine if these contact lists already exist."]
[null,1,"Objective 1.2",2,2,"Goal_1:2","Coordinate “snowball introductions” by reaching out to existing contacts, such as infection preventionists, and asking to be introduced to other key facility staff, such as Directors of Nursing and environmental cleaning staff. Ensure coordination with the state HAI/AR Program as well as other partners, such as state survey agencies, or Quality Improvement Networks-Quality Improvement Organizations (QIN-QIOs)."]
[null,1,"Objective 1.2",2,2,"Goal_1:2","When conducting outreach to newer healthcare partners, tangibly demonstrate the value of the public health department (e.g., provide relevant public health updates facilities should be aware of and/or share tools, resources, and guidance that address questions or challenges they have shared)."]
[null,1,"Objective 1.2",2,2,"Goal_1:2","Determine other partners and support that are being utilized by or available to facilities and providers for healthcare Infection Prevention and Control (IPC) and HAI/AR activities and training needs."]
[null,1,"Objective 1.2",2,2,"Goal_1:2","Attend APIC chapter meetings or other annual meetings with healthcare providers."]
[null,1,"Objective 1.2",2,2,"Goal_1:2","Create an “elevator speech” for explaining the important role of the health department HAI/AR program to IPC officials in hospitals or healthcare facilities"]
[null,1,"Objective 1.2",2,2,"Goal_1:2","Leverage any existing facility newsletters for broad communication with regional IPC partners"]
[null,1,"Objective 1.2",2,1,"Goal_1:2","Coordinate with the state HAI/AR Program to determine which healthcare settings, facilities, or providers are priorities for LHD support (e.g., based on cases, infection rates, outbreaks etc.) and for what purpose (see also Goal 2, Objective 2.2)."]
[null,1,"Objective 1.2",2,1,"Goal_1:2","Identify healthcare facilities within the jurisdiction, including but not limited to facilities that are licensed by the state and including those serving at- risk populations."]
[null,1,"Objective 1.2",2,1,"Goal_1:2","Establish regular contact with healthcare facilities and providers."]
{"$rows_left_out":264}
{"sheet":"Back End Data (Outcomes)","index":9,"n_rows":14,"n_cols":8,"rows_kept":14,"cut":false,"hidden":true,"merged":[]}
[]
[]
[]
[]
[null,"Goal","Level","Lookup","Outcome"]
[null,"Goal_1",1,{"$f":"B6&C6","v":"Goal_11"},"• Robust awareness of the key players in the HAI/AR landscape including contacts at the state HAI/AR program, healthcare facilities, public health organizations, and academic and community partners\n• Knowledge of local, state, and regional partners’ priorities ",null,"goal_1","Level 1\n• Robust awareness of the key players in the HAI/AR landscape including contacts at the state HAI/AR program, healthcare facilities, public health organizations, and academic and community partners\n• Knowledge of local, state, and regional partners’ priorities \n\nLevel 2\n• Developing, leading, and implementing plans for addressing shared priorities with key partners\n• Increasing engagement and communication channels with facilities\n\nLevel 3\n• Implementing initiatives on behalf of partner network priorities\n• Growing partner networks, either through increased partners or increased frequency\n\n\n"]
[null,"Goal_1",2,{"$f":"B7&C7","v":"Goal_12"},"• Developing, leading, and implementing plans for addressing shared priorities with key partners\n• Increasing engagement and communication channels with facilities",null,"goal_2","Level 1\n• Robust awareness of available IPC trainings and resources, available HAI/AR data sources, interjurisdictional partners, and local preparedness plans \n\nLevel 2\n• Increased LHD staff trained on IPC\n• Understanding of the latest HAI/AR policies, science, and guidance\n• Communication strategies consistent with state messaging\n• Plans for interjurisdictional collaboration\n• Increased understanding of local preparedness \n\nLevel 3\n• Robust training opportunities for LHD staff that cover IPC, related topics, and mentorship opportunities\n• Strategies for bi-directional knowledge sharing between LHDs and other partners\n• Leading prevention, preparedness, and response efforts \n\n\n"]
[null,"Goal_1",3,"Goal_13","• Implementing initiatives on behalf of partner network priorities\n• Growing partner networks, either through increased partners or increased frequency",null,"goal_3","Level 1\n• Robust awareness of the roles of the LHD in outbreak and response activities\n• Knowledge of state HAI/AR prevention strategies, stewardship activities, health equity goals, and resources\n• Coordination and communication with the state during outbreaks \n\nLevel 2\n• LHD playing an active role in outbreak response as defined with SHD, whether in shadowing, leading, or being updated \n• Using data for action at the local level \n• Designated stewardship activities at the local level\n• Local health equity goals \n\nLevel 3\n• Leading trainings to educate facilities on prevention, containment, and stewardship \n• Data assessment to determine trends\n• Using data to implement prevention strategies \n• Leading local health equity work \n\n\n"]
[null,"Goal_2",1,"Goal_21","• Robust awareness of available IPC trainings and resources, available HAI/AR data sources, interjurisdictional partners, and local preparedness plans "]
[null,"Goal_2",2,"Goal_22","• Increased LHD staff trained on IPC\n• Understanding of the latest HAI/AR policies, science, and guidance\n• Communication strategies consistent with state messaging\n• Plans for interjurisdictional collaboration\n• Increased understanding of local preparedness "]
[null,"Goal_2",3,"Goal_23","• Robust training opportunities for LHD staff that cover IPC, related topics, and mentorship opportunities\n• Strategies for bi-directional knowledge sharing between LHDs and other partners\n• Leading prevention, preparedness, and response efforts "]
[null,"Goal_3",1,"Goal_31","• Robust awareness of the roles of the LHD in outbreak and response activities\n• Knowledge of state HAI/AR prevention strategies, stewardship activities, health equity goals, and resources\n• Coordination and communication with the state during outbreaks "]
[null,"Goal_3",2,"Goal_32","• LHD playing an active role in outbreak response as defined with SHD, whether in shadowing, leading, or being updated \n• Using data for action at the local level \n• Designated stewardship activities at the local level\n• Local health equity goals "]
[null,"Goal_3",3,"Goal_33","• Leading trainings to educate facilities on prevention, containment, and stewardship \n• Data assessment to determine trends\n• Using data to implement prevention strategies \n• Leading local health equity work "]

{"sheet":"Back End (Passthrough)","index":10,"n_rows":0,"n_cols":0,"rows_kept":0,"cut":false,"hidden":true,"merged":[]}

{"sheet":"Back End (Tracker)","index":11,"n_rows":0,"n_cols":0,"rows_kept":0,"cut":false,"hidden":true,"merged":[]}

{"sheet":"Back End Data (Dropdrop)","index":12,"n_rows":19,"n_cols":11,"rows_kept":19,"cut":false,"hidden":true,"merged":[]}
[]
[null,"Goals",null,null,"Goal_1","Goal_2","Goal_3",null,"Obj #","Obj Desp."]
[null,"Goal_1","Increase LHD communication and collaboration within the public health sector and among public-private sector partners to develop and expand networks across state, regional, and local levels",null,"Objective 1.1","Objective 2.1","Objective 3.1",null,"Objective 1.1"," Engage with the state HAI/AR program to determine priorities, state and local roles responsibilities when working together, and to maintain coordination between the LHD and the state","Objective 1.1:  Engage with the state HAI/AR program to determine priorities, state and local roles responsibilities when working together, and to maintain coordination between the LHD and the state"]
[null,"Goal_2","Build LHD operational capacity to conduct and promote sustainable HAI/AR infection prevention and control activities",null,"Objective 1.2","Objective 2.2","Objective 3.2",null,"Objective 1.2"," Grow and sustain relationships between healthcare and public health at the local level tailored to meet the LHD’s healthcare facilities and providers’ needs","Objective 1.2:  Grow and sustain relationships between healthcare and public health at the local level tailored to meet the LHD’s healthcare facilities and providers’ needs"]
[null,"Goal_3","Expand LHD HAI/AR infection prevention, outbreak response and stewardship activities using data for action and prioritizing activities that increase impact on health equity",null,"Objective 1.3","Objective 2.3","Objective 3.3",null,"Objective 1.3"," Engage public health, healthcare, academic, and community partners in growing the partnership network to prevent HAI/AR in all patient populations within the local jurisdiction","Objective 1.3:  Engage public health, healthcare, academic, and community partners in growing the partnership network to prevent HAI/AR in all patient populations within the local jurisdiction"]
[null,null,null,null,null,"Objective 2.4","Objective 3.4",null,"Objective 2.1"," Increase local public health staff capacity, expertise, and confidence to conduct HAI/AR activities, in alignment with the overall state strategy","Objective 2.1:  Increase local public health staff capacity, expertise, and confidence to conduct HAI/AR activities, in alignment with the overall state strategy"]
[null,null,null,null,null,null,null,null,"Objective 2.2"," Support and increase awareness of HAI/AR science programs and policies that impact their community","Objective 2.2:  Support and increase awareness of HAI/AR science programs and policies that impact their community"]
[null,"Level",null,null,null,null,null,null,"Objective 2.3"," Increase interjurisdictional infrastructure and sustainability of local HAI/AR infection prevention and control activities, in alignment with the overall state or regional strategy","Objective 2.3:  Increase interjurisdictional infrastructure and sustainability of local HAI/AR infection prevention and control activities, in alignment with the overall state or regional strategy"]
[null,1,null,null,null,null,null,null,"Objective 2.4"," Develop and/or update local healthcare preparedness and response plans to have capacity for responding to emerging HAI/AR threats and outbreaks","Objective 2.4:  Develop and/or update local healthcare preparedness and response plans to have capacity for responding to emerging HAI/AR threats and outbreaks"]
[null,2,null,null,null,null,null,null,"Objective 3.1"," Implement HAI/AR outbreak and response strategies using data to identify appropriate participation in local, regional, and state-wide approaches","Objective 3.1:  Implement HAI/AR outbreak and response strategies using data to identify appropriate participation in local, regional, and state-wide approaches"]
[null,3,null,null,null,null,null,null,"Objective 3.2"," Implement infection prevention activities using available data to tailor and focus efforts","Objective 3.2:  Implement infection prevention activities using available data to tailor and focus efforts"]
[null,null,null,null,null,null,null,null,"Objective 3.3"," Implement antibiotic stewardship activities using data to tailor and focus efforts","Objective 3.3:  Implement antibiotic stewardship activities using data to tailor and focus efforts"]
[null,null,null,null,null,null,null,null,"Objective 3.4"," Support HAI/AR activities that promote health equity and are aligned with state health equity priorities","Objective 3.4:  Support HAI/AR activities that promote health equity and are aligned with state health equity priorities"]
[null,"Activities"]
[null,"Underway "]
[null,"Planned",null,null,null,null,null,null,"goals","objectives"]
[null,null,null,null,null,null,null,null,"Goal_1","\nObjective 1.1:  Engage with the State HAI/AR program to determine priorities, state and local roles responsibilities when working together, and to maintain coordination between the LHD and the state\n\nObjective 1.2:  Grow and sustain relationships between healthcare and public health at the local level tailored to meet the LHD’s healthcare facilities and providers’ needs\n\nObjective 1.3:  Engage public health, healthcare, academic, and community partners in growing the partnership network to prevent HAI/AR in all patient populations within the local jurisdiction"]
[null,null,null,null,null,null,null,null,"Goal_2","\nObjective 2.1:  Increase local public health staff capacity, expertise, and confidence to conduct HAI/AR activities, in alignment with the overall state strategy\n\nObjective 2.2:  Support and increase awareness of HAI/AR science programs and policies that impact your community\n\nObjective 2.3:  Increase interjurisdictional infrastructure and sustainability of local HAI/AR infection prevention and control activities, in alignment with the overall state or regional strategy\n\nObjective 2.4:  Develop and/or update local healthcare preparedness and response plans to have capacity for responding to emerging HAI/AR threats and outbreaks"]
[null,null,null,null,null,null,null,null,"Goal_3","\nObjective 3.1:  Implement HAI/AR outbreak and response strategies using data to identify appropriate participation in local, regional, and state-wide approaches\n\nObjective 3.2:  Implement infection prevention activities using available data to tailor and focus efforts\n\nObjective 3.3:  Implement antibiotic stewardship activities using data to tailor and focus efforts\n\nObjective 3.4:  Support HAI/AR activities that promote health equity and are aligned with state health equity priorities"]